{"text_format":"1","workbook":"xlsx","n_sheets":11,"sheets":["Valor Captação","CH","hora","kirrig","kfin","kclasse","ppu","Municípios","Equip. medicao","modo uso","Valor Lançamento"],"not_rendered":{"charts":0,"images":1,"macros":1,"external_links":0,"defined_names":13,"comments":0,"pivot_tables":0},"unopened":[],"bounds":{"document_bytes":16777216,"sheet_cells":100000,"rows_first":2000,"rows_last":500,"rows_between":2000,"halvings":0,"cell_chars":16384,"cell_head_chars":4096},"cells_cut":0,"cells_raw":0,"read":"whole","date_system":"1900"}

{"sheet":"Valor Captação","index":0,"n_rows":52,"n_cols":20,"rows_kept":52,"cut":false,"hidden":false,"merged":[[41,1,42,14],[43,1,44,14],[40,18,40,19],[41,18,41,19],[42,18,42,19],[43,18,43,19],[44,18,44,19],[9,1,9,5],[8,1,8,5],[36,18,36,19],[35,1,35,2],[35,4,35,5],[35,9,35,10],[35,12,35,13],[35,16,35,17],[35,18,35,19],[34,1,34,2],[34,4,34,5],[34,9,34,10],[34,12,34,13],[34,16,34,17],[34,18,34,19],[36,1,36,2],[36,4,36,5],[46,1,46,19],[49,1,49,19],[50,1,50,19],[45,1,45,19],[48,1,48,19],[37,1,37,2],[37,4,37,5],[37,9,37,10],[37,12,37,13],[37,16,37,17],[37,18,37,19],[39,18,39,19],[38,18,38,19],[47,1,47,19],[39,1,39,2],[39,4,39,5],[39,9,39,10],[39,12,39,13],[39,16,39,17],[38,1,38,2],[38,4,38,5],[38,9,38,10],[38,12,38,13],[38,16,38,17],[31,18,31,19],[36,9,36,10],[36,12,36,13],[36,16,36,17],[33,1,33,2],[33,4,33,5],[33,9,33,10],[33,12,33,13],[33,16,33,17],[33,18,33,19],[8,7,8,8],[9,7,9,8],[8,9,8,12],[8,13,8,14],[9,13,9,14],[27,8,27,12],[27,16,27,17],[19,1,19,2],[29,1,29,19],[20,2,20,10],[20,13,20,14],[20,16,20,17],[20,18,20,19],[23,17,23,19],[24,17,24,19],[27,5,27,6],[22,1,22,19],[25,17,25,19],[25,2,25,3],[27,3,27,4],[9,9,9,12],[24,2,24,3],[51,1,51,19],[11,1,11,14],[11,16,11,19],[12,16,12,19],[16,1,16,2],[17,1,17,2],[18,1,18,2],[30,1,30,2],[30,4,30,5],[30,9,30,10],[30,12,30,13],[30,16,30,17],[30,18,30,19],[32,1,32,2],[32,4,32,5],[32,9,32,10],[32,12,32,13],[32,16,32,17],[32,18,32,19],[31,1,31,2],[31,4,31,5],[31,9,31,10],[31,12,31,13],[31,16,31,17],[5,4,5,5],[5,6,5,7],[5,9,5,10],[5,11,5,15],[5,16,5,17],[5,18,5,19],[3,18,3,19],[6,4,6,5],[6,6,6,7],[6,9,6,10],[6,11,6,15],[6,16,6,17],[6,18,6,19],[2,1,2,13]]}
[null,null,null,null,null,null,null,null,null,null,null,null,null,null,null,"Data de atualização:","2023-04-03",null,null,"Versão 1.0.0.5"]
[]
[null,"SIMULADOR COBRANÇA PELO USO DE RECURSOS HÍDRICOS - CRH MG",null,null,null,null,null,null,null,null,null,null,null,null,null,null,null,null," Versão 1.0.0.12 - 20/01/2025"]
[null,"Para simular os valores, preencha os campos obrigatórios",null,null,null,null,null,null,null,null,null,null,null,null,"Versão 1.0.0.5",null,null,"Data da simulação:",{"$f":"TODAY()","v":"2025-01-20"}]
[]
[null,"Ano*","N. Portaria","n. Ponto","Data de Publicação*",null,"Data de Vencimento*",null,"Renov. Em analise?*","CPF/CNPJ",null,"Nome/Razão social",null,null,null,null,"inicio do cálculo ",null,"fim do cálculo "]
[null,2023,null,null,null,null,null,null,null,null,null,null,null,null,null,null,{"$f":"IF(ISBLANK(E7),DATE(B7,1,1),IF(YEAR(E7)=B7,E7,IF(I7=\"sim\",DATE(B7,1,1),IFERROR(IF(YEAR(G7)<B7,0,IF(YEAR(E7)>B7,0,DATE(B7,1,1))),0))))","v":"2023-01-01"},null,{"$f":"IF(YEAR(E7)>B7,0,IF(I7=\"SIM\",DATE(B7,12,31),IF(ISBLANK(G7),DATE(B7,12,31),IF(YEAR(G7)>B7,DATE(B7,12,31),IF(YEAR(G7)<B7,0,G7)))))","v":"2023-12-31"}]
[]
[null,"Selecione um Modo de uso*",null,null,null,null,"Área de conflito?","Enquadramento*",null,"Selecione a Bacia hidrográfica*",null,null,null,"Município*",null,"Pop. Urb. Sede","Tipo","Zona","Bacia","CH"]
[null,null,null,null,null,null,null,null,null,null,null,null,null,null,null,{"$f":"IFERROR(VLOOKUP(N10,Municípios!E:I,5,FALSE),\"\")","v":""},{"$f":"IFERROR(VLOOKUP(B10,'modo uso'!A:D,4,FALSE),\"\")","v":""},{"$f":"IFERROR(IF(AND(T10=\"GD1\",OR(I11=0,I11=1)),\"A\",IF(AND(T10=\"GD1\",OR(G11=25,I11=9)),\"B\",IF(T10=\"GD1\",\"C\",(IF(AND(T10=\"GD3\",G11=25),\"A\",IF(AND(T10=\"GD3\",OR(I11=9,I11=0,I11=1)),\"B\",IF(T10=\"GD3\",\"C\",IF(I11=9,\"C\",IF(AND(OR(I11=0,I11=1),G11<>25),\"C\",IF(AND(OR(I11=0,I11=1),G11=25),\"A\",IF(AND(OR(I11=2,I11=3,I11=4),G11=25),\"B\",\"D\"))))))))))),\"\")","v":"B"},{"$f":"IF(J10=\"CERH: Conselho Estadual de Recursos Hídricos\",\"não se aplica\",LEFT(T10,2))","v":""},{"$f":"IFERROR(VLOOKUP(J10,CH!E:H,4,FALSE),\"\")","v":""}]
[null,null,null,null,null,null,{"$f":"IF(G10=\"não\",0,25)","v":25},null,{"$f":"IF(Q11=\"subterraneo\",9,IF(H10=\"especial\",0,IF(ISBLANK(H10),2,H10)))","v":2},null,null,null,null,null,null,null,{"$f":"IFERROR(VLOOKUP(B10,'modo uso'!A:B,2,FALSE),\"\")","v":""}]
[null,"Quadro de vazão outorgada*",null,null,null,null,null,null,null,null,null,null,null,null,null,null,"Finalidades outorgadas*"]
[null,"Outorga","Unidade*","Jan","Fev","Mar","Abr","Mai","Jun","Jul","Ago","Set","Out","Nov","Dez",null,"Informe pelo menos uma finalidade"]
[null,null,null,31,{"$f":"IF(OR(B7=2016,B7=2020,B7=2024),29,28)","v":28},31,30,31,30,31,31,30,31,30,31]
[null,null,null,1,2,3,4,5,6,7,8,9,10,11,12]
[null,"Vazão",null,null,null,null,null,null,null,null,null,null,null,null,null,null,"Irrigação",null,"Outro uso rural"]
[null,"Horas/dia",null,null,null,null,null,null,null,null,null,null,null,null,null,null,"Mineração",null,"Rebaixamento",{"$f":"IFERROR(IF(VLOOKUP(B10,'modo uso'!A:C,3,FALSE)=23,\"x\",IF(VLOOKUP(B10,'modo uso'!A:C,3,FALSE)=10,\"x\",0)),0)","v":0}]
[null,"Dias outorgados/mês",null,null,null,null,null,null,null,null,null,null,null,null,null,null,"Indústria",null,"Saneamento"]
[null,"Dias cobrados/mês",null,{"$f":"IF(YEAR($Q7)=1900,0,IF(OR(MONTH($S7)<hora!O$1,MONTH($Q7)>hora!O$1),0,IF(AND(MONTH($Q7)=hora!O$1,MONTH($S7)=MONTH($Q7)),$S7+1-$Q7,IF(AND(MONTH($Q7)=hora!O$1,D18>0,D18>=D$14+1-DAY($Q7)),D$14+1-DAY($Q7),IF(AND(MONTH($Q7)=hora!O$1,D18>0,D18<D$14+1-DAY($Q7)),D18,IF(AND(MONTH($S7)=hora!O$1,D18>0,D18>=DAY($S7)),DAY($S7),IF(AND(MONTH($S7)=hora!O$1,D18>0,D18<DAY($S7)),D18,IF(AND(MONTH($Q7)<>hora!O$1,MONTH($S7)<>hora!O$1,D18>D14),D14,IF(D18<=D14,D18)))))))))","v":0},{"$f":"IF(YEAR($Q7)=1900,0,IF(OR(MONTH($S7)<hora!P$1,MONTH($Q7)>hora!P$1),0,IF(AND(MONTH($Q7)=hora!P$1,MONTH($S7)=MONTH($Q7)),$S7+1-$Q7,IF(AND(MONTH($Q7)=hora!P$1,E18>0,E18>=E$14+1-DAY($Q7)),E$14+1-DAY($Q7),IF(AND(MONTH($Q7)=hora!P$1,E18>0,E18<E$14+1-DAY($Q7)),E18,IF(AND(MONTH($S7)=hora!P$1,E18>0,E18>=DAY($S7)),DAY($S7),IF(AND(MONTH($S7)=hora!P$1,E18>0,E18<DAY($S7)),E18,IF(AND(MONTH($Q7)<>hora!P$1,MONTH($S7)<>hora!P$1,E18>E14),E14,IF(E18<=E14,E18)))))))))","v":0},{"$f":"IF(YEAR($Q7)=1900,0,IF(OR(MONTH($S7)<hora!Q$1,MONTH($Q7)>hora!Q$1),0,IF(AND(MONTH($Q7)=hora!Q$1,MONTH($S7)=MONTH($Q7)),$S7+1-$Q7,IF(AND(MONTH($Q7)=hora!Q$1,F18>0,F18>=F$14+1-DAY($Q7)),F$14+1-DAY($Q7),IF(AND(MONTH($Q7)=hora!Q$1,F18>0,F18<F$14+1-DAY($Q7)),F18,IF(AND(MONTH($S7)=hora!Q$1,F18>0,F18>=DAY($S7)),DAY($S7),IF(AND(MONTH($S7)=hora!Q$1,F18>0,F18<DAY($S7)),F18,IF(AND(MONTH($Q7)<>hora!Q$1,MONTH($S7)<>hora!Q$1,F18>F14),F14,IF(F18<=F14,F18)))))))))","v":0},{"$f":"IF(YEAR($Q7)=1900,0,IF(OR(MONTH($S7)<hora!R$1,MONTH($Q7)>hora!R$1),0,IF(AND(MONTH($Q7)=hora!R$1,MONTH($S7)=MONTH($Q7)),$S7+1-$Q7,IF(AND(MONTH($Q7)=hora!R$1,G18>0,G18>=G$14+1-DAY($Q7)),G$14+1-DAY($Q7),IF(AND(MONTH($Q7)=hora!R$1,G18>0,G18<G$14+1-DAY($Q7)),G18,IF(AND(MONTH($S7)=hora!R$1,G18>0,G18>=DAY($S7)),DAY($S7),IF(AND(MONTH($S7)=hora!R$1,G18>0,G18<DAY($S7)),G18,IF(AND(MONTH($Q7)<>hora!R$1,MONTH($S7)<>hora!R$1,G18>G14),G14,IF(G18<=G14,G18)))))))))","v":0},{"$f":"IF(YEAR($Q7)=1900,0,IF(OR(MONTH($S7)<hora!S$1,MONTH($Q7)>hora!S$1),0,IF(AND(MONTH($Q7)=hora!S$1,MONTH($S7)=MONTH($Q7)),$S7+1-$Q7,IF(AND(MONTH($Q7)=hora!S$1,H18>0,H18>=H$14+1-DAY($Q7)),H$14+1-DAY($Q7),IF(AND(MONTH($Q7)=hora!S$1,H18>0,H18<H$14+1-DAY($Q7)),H18,IF(AND(MONTH($S7)=hora!S$1,H18>0,H18>=DAY($S7)),DAY($S7),IF(AND(MONTH($S7)=hora!S$1,H18>0,H18<DAY($S7)),H18,IF(AND(MONTH($Q7)<>hora!S$1,MONTH($S7)<>hora!S$1,H18>H14),H14,IF(H18<=H14,H18)))))))))","v":0},{"$f":"IF(YEAR($Q7)=1900,0,IF(OR(MONTH($S7)<hora!T$1,MONTH($Q7)>hora!T$1),0,IF(AND(MONTH($Q7)=hora!T$1,MONTH($S7)=MONTH($Q7)),$S7+1-$Q7,IF(AND(MONTH($Q7)=hora!T$1,I18>0,I18>=I$14+1-DAY($Q7)),I$14+1-DAY($Q7),IF(AND(MONTH($Q7)=hora!T$1,I18>0,I18<I$14+1-DAY($Q7)),I18,IF(AND(MONTH($S7)=hora!T$1,I18>0,I18>=DAY($S7)),DAY($S7),IF(AND(MONTH($S7)=hora!T$1,I18>0,I18<DAY($S7)),I18,IF(AND(MONTH($Q7)<>hora!T$1,MONTH($S7)<>hora!T$1,I18>I14),I14,IF(I18<=I14,I18)))))))))","v":0},{"$f":"IF(YEAR($Q7)=1900,0,IF(OR(MONTH($S7)<hora!U$1,MONTH($Q7)>hora!U$1),0,IF(AND(MONTH($Q7)=hora!U$1,MONTH($S7)=MONTH($Q7)),$S7+1-$Q7,IF(AND(MONTH($Q7)=hora!U$1,J18>0,J18>=J$14+1-DAY($Q7)),J$14+1-DAY($Q7),IF(AND(MONTH($Q7)=hora!U$1,J18>0,J18<J$14+1-DAY($Q7)),J18,IF(AND(MONTH($S7)=hora!U$1,J18>0,J18>=DAY($S7)),DAY($S7),IF(AND(MONTH($S7)=hora!U$1,J18>0,J18<DAY($S7)),J18,IF(AND(MONTH($Q7)<>hora!U$1,MONTH($S7)<>hora!U$1,J18>J14),J14,IF(J18<=J14,J18)))))))))","v":0},{"$f":"IF(YEAR($Q7)=1900,0,IF(OR(MONTH($S7)<hora!V$1,MONTH($Q7)>hora!V$1),0,IF(AND(MONTH($Q7)=hora!V$1,MONTH($S7)=MONTH($Q7)),$S7+1-$Q7,IF(AND(MONTH($Q7)=hora!V$1,K18>0,K18>=K$14+1-DAY($Q7)),K$14+1-DAY($Q7),IF(AND(MONTH($Q7)=hora!V$1,K18>0,K18<K$14+1-DAY($Q7)),K18,IF(AND(MONTH($S7)=hora!V$1,K18>0,K18>=DAY($S7)),DAY($S7),IF(AND(MONTH($S7)=hora!V$1,K18>0,K18<DAY($S7)),K18,IF(AND(MONTH($Q7)<>hora!V$1,MONTH($S7)<>hora!V$1,K18>K14),K14,IF(K18<=K14,K18)))))))))","v":0},{"$f":"IF(YEAR($Q7)=1900,0,IF(OR(MONTH($S7)<hora!W$1,MONTH($Q7)>hora!W$1),0,IF(AND(MONTH($Q7)=hora!W$1,MONTH($S7)=MONTH($Q7)),$S7+1-$Q7,IF(AND(MONTH($Q7)=hora!W$1,L18>0,L18>=L$14+1-DAY($Q7)),L$14+1-DAY($Q7),IF(AND(MONTH($Q7)=hora!W$1,L18>0,L18<L$14+1-DAY($Q7)),L18,IF(AND(MONTH($S7)=hora!W$1,L18>0,L18>=DAY($S7)),DAY($S7),IF(AND(MONTH($S7)=hora!W$1,L18>0,L18<DAY($S7)),L18,IF(AND(MONTH($Q7)<>hora!W$1,MONTH($S7)<>hora!W$1,L18>L14),L14,IF(L18<=L14,L18)))))))))","v":0},{"$f":"IF(YEAR($Q7)=1900,0,IF(OR(MONTH($S7)<hora!X$1,MONTH($Q7)>hora!X$1),0,IF(AND(MONTH($Q7)=hora!X$1,MONTH($S7)=MONTH($Q7)),$S7+1-$Q7,IF(AND(MONTH($Q7)=hora!X$1,M18>0,M18>=M$14+1-DAY($Q7)),M$14+1-DAY($Q7),IF(AND(MONTH($Q7)=hora!X$1,M18>0,M18<M$14+1-DAY($Q7)),M18,IF(AND(MONTH($S7)=hora!X$1,M18>0,M18>=DAY($S7)),DAY($S7),IF(AND(MONTH($S7)=hora!X$1,M18>0,M18<DAY($S7)),M18,IF(AND(MONTH($Q7)<>hora!X$1,MONTH($S7)<>hora!X$1,M18>M14),M14,IF(M18<=M14,M18)))))))))","v":0},{"$f":"IF(YEAR($Q7)=1900,0,IF(OR(MONTH($S7)<hora!Y$1,MONTH($Q7)>hora!Y$1),0,IF(AND(MONTH($Q7)=hora!Y$1,MONTH($S7)=MONTH($Q7)),$S7+1-$Q7,IF(AND(MONTH($Q7)=hora!Y$1,N18>0,N18>=N$14+1-DAY($Q7)),N$14+1-DAY($Q7),IF(AND(MONTH($Q7)=hora!Y$1,N18>0,N18<N$14+1-DAY($Q7)),N18,IF(AND(MONTH($S7)=hora!Y$1,N18>0,N18>=DAY($S7)),DAY($S7),IF(AND(MONTH($S7)=hora!Y$1,N18>0,N18<DAY($S7)),N18,IF(AND(MONTH($Q7)<>hora!Y$1,MONTH($S7)<>hora!Y$1,N18>N14),N14,IF(N18<=N14,N18)))))))))","v":0},{"$f":"IF(YEAR($Q7)=1900,0,IF(OR(MONTH($S7)<hora!Z$1,MONTH($Q7)>hora!Z$1),0,IF(AND(MONTH($Q7)=hora!Z$1,MONTH($S7)=MONTH($Q7)),$S7+1-$Q7,IF(AND(MONTH($Q7)=hora!Z$1,O18>0,O18>=O$14+1-DAY($Q7)),O$14+1-DAY($Q7),IF(AND(MONTH($Q7)=hora!Z$1,O18>0,O18<O$14+1-DAY($Q7)),O18,IF(AND(MONTH($S7)=hora!Z$1,O18>0,O18>=DAY($S7)),DAY($S7),IF(AND(MONTH($S7)=hora!Z$1,O18>0,O18<DAY($S7)),O18,IF(AND(MONTH($Q7)<>hora!Z$1,MONTH($S7)<>hora!Z$1,O18>O14),O14,IF(O18<=O14,O18)))))))))","v":0},null,"Cons.humano",null,"Outra finalidade"]
[null,"Volume cobrado (m3)",null,{"$f":"IF($C$16=\"m3/h\",D16*D17*D19,IF($C$16=\"l/s\",D16*3.6*D17*D19,D16*3600*D17*D19))","v":0},{"$f":"IF($C$16=\"m3/h\",E16*E17*E19,IF($C$16=\"l/s\",E16*3.6*E17*E19,E16*3600*E17*E19))","v":0},0,0,0,0,0,0,0,0,0,0,null,null,{"$f":"IF(R16=\"x\",1,0)","v":0},null,{"$f":"COUNTIFS(R16:T19,\"x\")","v":0}]
[null,null,null,null,null,null,null,null,null,null,null,null,"Total",{"$f":"ROUND(SUM(D20:O20),2)","v":0},null,null,"Sistema de irrigação*"]
[]
[null,"Volume mensal captado medido em m³/mês "]
[null,"Unidade","Houve medição?",null,"Jan","Fev","Mar","Abr","Mai","Jun","Jul","Ago","Set","Out","Nov","Dez","Coef. retorno","Total (m3/ano)"]
[null,"m3/mês","Não",null,null,null,null,null,null,null,null,null,null,null,null,null,null,{"$f":"SUM(E25:P25)","v":0}]
[null,"Meses cobrados",{"$f":"IF(ISBLANK(C25),\"Não\",C25)","v":"Não"},null,{"$f":"IF($C$26=\"Não\",D20,IF($C$26=\"captação não instalada\",0,IF(D20=0,0,E25)))","v":0},{"$f":"IF($C$26=\"Não\",E20,IF($C$26=\"captação não instalada\",0,IF(E20=0,0,F25)))","v":0},0,0,0,0,0,0,0,0,0,0,{"$f":"IF(C26=\"Não\",0,IF(C26=\"Captação não instalada\",1,Q25/100))","v":0},{"$f":"ROUND(IF(ISBLANK(C26),N21,IF(C26=\"Não\",N21,IF(C26=\"Captação não instalada\",0,SUM(E26:P26)))),2)","v":0}]
[]
[null,null,null,"Sistema de irrigação*",null,{"$f":"IF(ISBLANK(S21),\"outro\",S21)","v":"outro"},null,null,"Proporção entre medido e outorgado",null,null,null,null,{"$f":"IFERROR(R26/N21,0)","v":0},null,null,"Kmed extra",null,{"$f":"IFERROR(IF(ISBLANK(C26),0,IF(C26=\"Não\",0,IF(C26=\"Captação não instalada\",1,IF(R26/N21<0.7,1,0)))),0)","v":0}]
[]
[null,"Valores calculados por finalidade para a outorga e ano base"]
[null,"Finalidades",null,"% (1)","Vol. Cap (m3/ano) (2)",null,"PPUcap (3)","kcap (4)","kfin (5)","Valor captação",null,"Coefcons.(6)","Vol. Cons (m3/ano)",null,"PPUcons (7)","kfin (4)","Valor consumo",null,"Valor total"]
[null,"Irrigação",null,{"$f":"IF(OR($T$17=\"x\",$R$16=0),0,IF(AND($R$16=\"x\",$T$20=1),1,IF(AND($R$16=\"x\",$T$20>1),0.9)))","v":0},{"$f":"IFERROR(IF(AND(T10=\"PN2\",B7>2022),($N$21+$R$26)/2,IF($T$10=\"SF5\",$N$21,IF(AND(OR($S$10=\"DO\",$S$10=\"PS\",$T$10=\"PN2\",$T$10=\"SF2\",$T$10=\"PJ1\"),($R$26>$N$21)),$R$26,IF(OR($S$10=\"DO\",$S$10=\"PS\",$T$10=\"PN2\",$T$10=\"SF2\",$T$10=\"SF2\",$T$10=\"PJ1\"),(0.2*$N$21+0.8*$R$26+$S$28*(0.7*$N$21-$R$26)),IF($T$10=\"GD3\",$N$21,IF($C$26=\"Não\",$N$21,($N$21+$R$26)/2))))))*D32,0)","v":0},null,{"$f":"IF(E32=0,0,IF(AND(T10=\"pn2\",B7>2022,Q11=\"SUBTERRANEO\"),SUMIFS(ppu!K:K,ppu!A:A,$B$7,ppu!B:B,$T$10,ppu!C:C,$R$10),IF(N21>250000,SUMIFS(ppu!L:L,ppu!A:A,$B$7,ppu!B:B,$T$10,ppu!C:C,$R$10)++SUMIFS(ppu!$D:$D,ppu!$A:$A,$B$7,ppu!$B:$B,$T$10,ppu!$C:$C,$Q$11),SUMIFS(ppu!K:K,ppu!A:A,$B$7,ppu!B:B,$T$10,ppu!C:C,$R$10)+SUMIFS(ppu!$D:$D,ppu!$A:$A,$B$7,ppu!$B:$B,$T$10,ppu!$C:$C,$Q$11))))","v":0},{"$f":"IF(E32=0,0,IF(AND($B$7>2022,$T$10=\"PN2\"),1,SUMIFS(kclasse!$D:$D,kclasse!$B:$B,$T$10,kclasse!$C:$C,$I$11)))","v":0},{"$f":"IF(E32=0,0,IF(AND(B7>2022,T10=\"PN2\"),1,SUMIFS(kirrig!$D:$D,kirrig!$B:$B,$T10,kirrig!$C:$C,$F28)))","v":0},{"$f":"ROUND(IFERROR(E32*G32*H32*I32,\"\"),2)","v":0},null,{"$f":"IF(OR(E32=0,C26=\"captação não instalada\"),0,SUMIFS(kirrig!$E:$E,kirrig!$B:$B,$T10,kirrig!$C:$C,$F28))","v":0},{"$f":"$R$26*D32*L32","v":0},null,{"$f":"IF(M32=0,0,SUMIFS(ppu!E:E,ppu!B:B,$T$10,ppu!A:A,$B$7,ppu!C:C,$Q$11))","v":0},{"$f":"IF(O32=0,0,SUMIFS(kirrig!$D:$D,kirrig!$B:$B,$T10,kirrig!$C:$C,$F28))","v":0},{"$f":"M32*O32*P32","v":0},null,{"$f":"IFERROR(J32+Q32,\"\")","v":0}]
[null,"Outros usos rurais",null,{"$f":"IF(OR($T$17=\"x\",$T$16=0),0,IF(AND($T$16=\"x\",$T$20=1),1,IF(AND($T$16=\"x\",$T$20>1),(1-$D$32)/($T$20-$R$20))))","v":0},{"$f":"IFERROR(IF(AND(T10=\"PN2\",B7>2022),($N$21+$R$26)/2,IF($T$10=\"SF5\",$N$21,IF(AND(OR($S$10=\"DO\",$S$10=\"PS\",$T$10=\"PN2\",$T$10=\"SF2\",$T$10=\"PJ1\"),($R$26>$N$21)),$R$26,IF(OR($S$10=\"DO\",$S$10=\"PS\",$T$10=\"PN2\",$T$10=\"SF2\",$T$10=\"SF2\",$T$10=\"PJ1\"),(0.2*$N$21+0.8*$R$26+$S$28*(0.7*$N$21-$R$26)),IF($T$10=\"GD3\",$N$21,IF($C$26=\"Não\",$N$21,($N$21+$R$26)/2))))))*D33,0)","v":0},null,{"$f":"IF(E33=0,0,IF(AND(T11=\"pn3\",N22>250000),SUMIFS(ppu!L:L,ppu!A:A,$B$7,ppu!B:B,$T$10,ppu!C:C,$R$10),SUMIFS(ppu!J:J,ppu!A:A,$B$7,ppu!B:B,$T$10,ppu!C:C,$R$10)+SUMIFS(ppu!$D:$D,ppu!$A:$A,$B$7,ppu!$B:$B,$T$10,ppu!$C:$C,$Q$11)))","v":0},{"$f":"IF(E33=0,0,IF(AND($B$7>2022,$T$10=\"PN2\"),1,SUMIFS(kclasse!$D:$D,kclasse!$B:$B,$T$10,kclasse!$C:$C,$I$11)))","v":0},{"$f":"IF(E33=0,0,IF(AND($B$7>2022,$T$10=\"PN2\"),1,SUMIFS(kfin!C:C,kfin!B:B,'Valor Captação'!$T$10)))","v":0},{"$f":"IFERROR(E33*G33*H33*I33,\"\")","v":0},null,{"$f":"IF(E33=0,0,IF($C$26=\"Não\",1,1-$Q$26))","v":0},{"$f":"$R$26*D33*L33","v":0},null,{"$f":"IF(M33=0,0,SUMIFS(ppu!E:E,ppu!B:B,$T$10,ppu!A:A,$B$7,ppu!C:C,$Q$11))","v":0},{"$f":"IF(O33=0,0,SUMIFS(kfin!$C:$C,kfin!$B:$B,$T10))","v":0},{"$f":"M33*O33*P33","v":0},null,{"$f":"IFERROR(J33+Q33,\"\")","v":0}]
[null,"Rebaixamento",null,{"$f":"IF($T$17=0,0,IF($T$17=\"x\",1,0))","v":0},{"$f":"IFERROR(IF(AND(T10=\"PN2\",B7>2022),$R$26,IF($T$10=\"SF5\",$N$21,IF(AND(OR($S$10=\"DO\",$S$10=\"PS\",$T$10=\"PN2\",$T$10=\"SF2\",$T$10=\"PJ1\"),($R$26>$N$21)),$R$26,IF(OR($S$10=\"DO\",$S$10=\"PS\",$T$10=\"PN2\",$T$10=\"SF2\",$T$10=\"SF2\",$T$10=\"PJ1\"),(0.2*$N$21+0.8*$R$26+$S$28*(0.7*$N$21-$R$26)),IF($T$10=\"GD3\",$N$21,IF($C$26=\"Não\",$N$21,($R$26)))))))*D34,0)","v":0},null,{"$f":"IF(E34=0,0,SUMIFS(ppu!M:M,ppu!A:A,$B$7,ppu!B:B,$T$10,ppu!C:C,$R$10)+SUMIFS(ppu!$D:$D,ppu!$A:$A,$B$7,ppu!$B:$B,$T$10,ppu!$C:$C,$Q$11))","v":0},{"$f":"IF(E34=0,0,IF(AND($B$7>2022,$T$10=\"PN2\"),1,SUMIFS(kclasse!$D:$D,kclasse!$B:$B,$T$10,kclasse!$C:$C,$I$11)))","v":0},{"$f":"IF(E34=0,0,IF(T10=\"sf5\",0.5,1))","v":0},0,null,{"$f":"IF(E34=0,0,IF(AND($T$10=\"SF2\",$C$26=\"Não\"),0.5,IF($C$26=\"Não\",1,1-$Q$26)))","v":0},0,null,{"$f":"IF(M34=0,0,SUMIFS(ppu!E:E,ppu!B:B,$T$10,ppu!A:A,$B$7,ppu!C:C,$Q$11))","v":0},{"$f":"IF(O34=0,0,IF($T$10=\"SF2\",0.7,1))","v":0},0,null,0]
[null,"Mineração",null,{"$f":"IF(OR($T$17=\"x\",$R$17=0),0,IF(AND($R$17=\"x\",$T$20=1),1,IF(AND($R$17=\"x\",$T$20>1),(1-$D$32)/($T$20-$R$20))))","v":0},{"$f":"IFERROR(IF(AND(T10=\"PN2\",B7>2022),$N$21,IF($T$10=\"SF5\",$N$21,IF(AND(OR($S$10=\"DO\",$S$10=\"PS\",$T$10=\"PN2\",$T$10=\"SF2\",$T$10=\"PJ1\"),($R$26>$N$21)),$R$26,IF(OR($S$10=\"DO\",$S$10=\"PS\",$T$10=\"PN2\",$T$10=\"SF2\",$T$10=\"SF2\",$T$10=\"PJ1\"),(0.2*$N$21+0.8*$R$26+$S$28*(0.7*$N$21-$R$26)),$N$21))))*D35,0)","v":0},null,{"$f":"IF(E35=0,0,SUMIFS(ppu!O:O,ppu!A:A,$B$7,ppu!B:B,$T$10,ppu!C:C,$R$10)+SUMIFS(ppu!$D:$D,ppu!$A:$A,$B$7,ppu!$B:$B,$T$10,ppu!$C:$C,$Q$11))","v":0},{"$f":"IF(E35=0,0,IF(AND($B$7>2022,$T$10=\"PN2\"),1,SUMIFS(kclasse!$D:$D,kclasse!$B:$B,$T$10,kclasse!$C:$C,$I$11)))","v":0},{"$f":"IF(E35=0,0,IF(T10=\"sf5\",0.75,1))","v":0},0,null,{"$f":"IF(E35=0,0,IF(AND($T$10=\"SF2\",$C$26=\"Não\"),0.5,IF($C$26=\"Não\",1,1-$Q$26)))","v":0},0,null,{"$f":"IF(M35=0,0,SUMIFS(ppu!E:E,ppu!B:B,$T$10,ppu!A:A,$B$7,ppu!C:C,$Q$11))","v":0},{"$f":"IF(O35=0,0,IF($T$10=\"SF2\",0.7,1))","v":0},0,null,0]
[null,"Indústria",null,{"$f":"IF(OR($T$17=\"x\",$R$18=0),0,IF(AND($R$18=\"x\",$T$20=1),1,IF(AND($R$18=\"x\",$T$20>1),(1-$D$32)/($T$20-$R$20))))","v":0},{"$f":"IFERROR(IF(AND(T10=\"PN2\",B7>2022),$N$21,IF($T$10=\"SF5\",$N$21,IF(AND(OR($S$10=\"DO\",$S$10=\"PS\",$T$10=\"PN2\",$T$10=\"SF2\",$T$10=\"PJ1\"),($R$26>$N$21)),$R$26,IF(OR($S$10=\"DO\",$S$10=\"PS\",$T$10=\"PN2\",$T$10=\"SF2\",$T$10=\"SF2\",$T$10=\"PJ1\"),(0.2*$N$21+0.8*$R$26+$S$28*(0.7*$N$21-$R$26)),$N$21))))*D36,0)","v":0},null,{"$f":"IF(E36=0,0,SUMIFS(ppu!N:N,ppu!A:A,$B$7,ppu!B:B,$T$10,ppu!C:C,$R$10)+SUMIFS(ppu!$D:$D,ppu!$A:$A,$B$7,ppu!$B:$B,$T$10,ppu!$C:$C,$Q$11))","v":0},{"$f":"IF(E36=0,0,IF(AND($B$7>2022,$T$10=\"PN2\"),1,SUMIFS(kclasse!$D:$D,kclasse!$B:$B,$T$10,kclasse!$C:$C,$I$11)))","v":0},{"$f":"IF(E36=0,0,1)","v":0},{"$f":"IFERROR(E36*G36*H36*I36,\"\")","v":0},null,{"$f":"IF(E36=0,0,IF(AND($T$10=\"sf2\",$C$26=\"Não\"),0.5,IF($C$26=\"Não\",1,1-$Q$26)))","v":0},{"$f":"$R$26*D36*L36","v":0},null,{"$f":"IF(M36=0,0,SUMIFS(ppu!E:E,ppu!B:B,$T$10,ppu!A:A,$B$7,ppu!C:C,$Q$11))","v":0},{"$f":"IF(O36=0,0,IF($T$10=\"SF2\",0.7,1))","v":0},0,null,0]
[null,"Saneamento",null,{"$f":"IF(OR($T$17=\"x\",$T$18=0),0,IF(AND($T$18=\"x\",$T$20=1),1,IF(AND($T$18=\"x\",$T$20>1),(1-$D$32)/($T$20-$R$20))))","v":0},{"$f":"IFERROR(IF(AND(T10=\"PN2\",B7>2022),$R$26,IF($T$10=\"SF5\",(0.2*$N$21+0.8*$R$26+$S$28*(0.7*$N$21-$R$26)),IF(AND(OR($S$10=\"DO\",$S$10=\"PS\",$T$10=\"PN2\",$T$10=\"SF2\",$T$10=\"PJ1\"),($R$26>$N$21)),$R$26,IF(OR($S$10=\"DO\",$S$10=\"PS\",$T$10=\"PN2\",$T$10=\"SF2\",$T$10=\"SF2\",$T$10=\"PJ1\"),(0.2*$N$21+0.8*$R$26+$S$28*(0.7*$N$21-$R$26)),IF($T$10=\"GD3\",$N$21,IF($C$26=\"Não\",$N$21,($R$26)))))))*D37,0)","v":0},null,{"$f":"IF(E37=0,0,SUMIFS(ppu!$D:$D,ppu!$A:$A,$B$7,ppu!$B:$B,$T$10,ppu!$C:$C,$Q$11)+IF(P10>=100000,SUMIFS(ppu!I:I,ppu!A:A,$B$7,ppu!B:B,$T$10,ppu!C:C,$R$10),SUMIFS(ppu!H:H,ppu!A:A,$B$7,ppu!B:B,$T$10,ppu!C:C,$R$10)))","v":0},{"$f":"IF(E37=0,0,IF(AND($B$7>2022,$T$10=\"PN2\"),1,SUMIFS(kclasse!$D:$D,kclasse!$B:$B,$T$10,kclasse!$C:$C,$I$11)))","v":0},{"$f":"IF(E37=0,0,1)","v":0},0,null,{"$f":"IF(E37=0,0,IF($C$26=\"Não\",0.2,1-$Q$26))","v":0},0,null,{"$f":"IF(M37=0,0,SUMIFS(ppu!E:E,ppu!B:B,$T$10,ppu!A:A,$B$7,ppu!C:C,$Q$11))","v":0},{"$f":"IF(O37=0,0,1)","v":0},0,null,0]
[null,"Consumo humano",null,{"$f":"IF(OR($T$17=\"x\",$R$19=0),0,IF(AND($R$19=\"x\",$T$20=1),1,IF(AND($R$19=\"x\",$T$20>1),(1-$D$32)/($T$20-$R$20))))","v":0},{"$f":"IFERROR(IF(AND(T10=\"PN2\",B7>2022),$N$21,IF($T$10=\"SF5\",$N$21,IF(AND(OR($S$10=\"DO\",$S$10=\"PS\",$T$10=\"PN2\",$T$10=\"SF2\",$T$10=\"PJ1\"),($R$26>$N$21)),$R$26,IF(OR($S$10=\"DO\",$S$10=\"PS\",$T$10=\"PN2\",$T$10=\"SF2\",$T$10=\"SF2\",$T$10=\"PJ1\"),(0.2*$N$21+0.8*$R$26+$S$28*(0.7*$N$21-$R$26)),$N$21))))*D38,0)","v":0},null,{"$f":"IF(E38=0,0,SUMIFS(ppu!O:O,ppu!A:A,$B$7,ppu!B:B,$T$10,ppu!C:C,$R$10)+SUMIFS(ppu!$D:$D,ppu!$A:$A,$B$7,ppu!$B:$B,$T$10,ppu!$C:$C,$Q$11))","v":0},{"$f":"IF(E38=0,0,IF(AND($B$7>2022,$T$10=\"PN2\"),1,SUMIFS(kclasse!$D:$D,kclasse!$B:$B,$T$10,kclasse!$C:$C,$I$11)))","v":0},{"$f":"IF(E38=0,0,1)","v":0},0,null,{"$f":"IF(E38=0,0,IF($C$26=\"Não\",0.2,1-$Q$26))","v":0},0,null,{"$f":"IF(M38=0,0,SUMIFS(ppu!E:E,ppu!B:B,$T$10,ppu!A:A,$B$7,ppu!C:C,$Q$11))","v":0},{"$f":"IF(O38=0,0,1)","v":0},0,null,0]
[null,"Outras finalidades",null,{"$f":"IF(OR($T$17=\"x\",$T$19=0),0,IF(AND($T$19=\"x\",$T$20=1),1,IF(AND($T$19=\"x\",$T$20>1),(1-$D$32)/($T$20-$R$20))))","v":0},{"$f":"IFERROR(IF(AND(T10=\"PN2\",B7>2022),$N$21,IF($T$10=\"SF5\",$N$21,IF(AND(OR($S$10=\"DO\",$S$10=\"PS\",$T$10=\"PN2\",$T$10=\"SF2\",$T$10=\"PJ1\"),($R$26>$N$21)),$R$26,IF(OR($S$10=\"DO\",$S$10=\"PS\",$T$10=\"PN2\",$T$10=\"SF2\",$T$10=\"SF2\",$T$10=\"PJ1\"),(0.2*$N$21+0.8*$R$26+$S$28*(0.7*$N$21-$R$26)),$N$21))))*D39,0)","v":0},null,{"$f":"IF(E39=0,0,SUMIFS(ppu!O:O,ppu!A:A,$B$7,ppu!B:B,$T$10,ppu!C:C,$R$10)+SUMIFS(ppu!$D:$D,ppu!$A:$A,$B$7,ppu!$B:$B,$T$10,ppu!$C:$C,$Q$11))","v":0},{"$f":"IF(E39=0,0,IF(AND($B$7>2022,$T$10=\"PN2\"),1,SUMIFS(kclasse!$D:$D,kclasse!$B:$B,$T$10,kclasse!$C:$C,$I$11)))","v":0},{"$f":"IF(E39=0,0,1)","v":0},0,null,{"$f":"IF(E39=0,0,IF($C$26=\"Não\",1,1-$Q$26))","v":0},0,null,{"$f":"IF(M39=0,0,SUMIFS(ppu!E:E,ppu!B:B,$T$10,ppu!A:A,$B$7,ppu!C:C,$Q$11))","v":0},{"$f":"IF(O39=0,0,1)","v":0},0,null,0]
[null,"Total",null,null,{"$f":"SUM(E32:F39)","v":0},null,null,null,{"$f":"IF(E40=0,0,1)","v":0},{"$f":"SUM(J32:K39)","v":0},null,null,{"$f":"SUM(M32:N39)","v":0},null,null,null,{"$f":"SUM(Q32:R39)","v":0},null,{"$f":"IFERROR(SUM(S32:T39),0)","v":0}]
[null,"Observações:",null,null,null,null,null,null,null,null,null,null,null,null,null,null,null,"Acerto ou Valor acumulado: ",0]
[null,{"$f":"IF(AND(S42>0,S42<200),\"Valores abaixo de R$ 200,00 são acumulados até atingir esse montante para emissão de boletos, conforme Decreto 48.160/2021.\",\"\")","v":""},null,null,null,null,null,null,null,null,null,null,null,null,null,null,null,"Total: ",{"$f":"S40-S41","v":0}]
[null,null,null,null,null,null,null,null,null,null,null,null,null,null,null,null,null,"Valor pago:",0]
[null,{"$f":"IF(S41<>0,CONCATENATE(\"DET. DEBITO: Vol. Out. (\",N21,\"m3) Vol. Med - na ausencia o out - (\",R26,\"m3) [Vcap = R$\",J40,\"] [Acerto = R$\",S41,\"]  [Total = R$\",S42,\"] [\",V41,\"]\"),CONCATENATE(\"DET. DEBITO: Vol. Out. (\",N21,\"m3) Vol. Med - na ausencia o out - (\",R26,\"m3) [Vcap = R$\",J40,\"]  [Total = R$\",S42,\"]\",\"\"))","v":"DET. DEBITO: Vol. Out. (0m3) Vol. Med - na ausencia o out - (0m3) [Vcap = R$0]  [Total = R$0]"},null,null,null,null,null,null,null,null,null,null,null,null,null,null,null,"n. Parcelas a ajustar: ",0]
[null,null,null,null,null,null,null,null,null,null,null,null,null,null,null,null,null,"Valor próximas parcelas: ",{"$f":"IF(S43>0,(S42-S43)/S44,IF(S42<1000,S42,S42/4))","v":0},{"$f":"(S42-S43)/S44","v":{"$error":"#DIV/0!"}}]
[null,"1. Percentuais estabelecidos conforme Portaria Igam n. 79/2021"]
[null,"2. O volume captado indica o volume a ser cobrado conforme cálculo baseado na metodologia aprovada pela comitê, podendo ser o volume outorgado, ou o volume medido ou ainda uma proporção entre o medido e o outorgado. "]
[null,"3. PPUcap: preço público unitário de captação em R$/m3"]
[null,"4. Coeficiente relacionado com a classe de enquadramento. A nomenclatura pode variar de comitê para comitê. Caso não seja informada a classe de enquadramento, o coeficiente considerará os valores referentes a classe 2."]
[null,"5. kfinalidade. Nas metodologias aprovadas pelos comitês, há uma variedade de coeficientes ou de fatores multiplicadores dependendo da finalidade ou ainda do sistema de irrigação. Embora tenhamos adotado uma nomenclatura padrão para simplificação da planilha, os valores são exatamente aqueles que foram aprovados pelos comitês. Quando não existir coeficiente ou fator multplicador, será adotado o valor 1. "]
[null,"6. O coeficiente de consumo é o coeficiente utilizado para determinar o volume consumido por outorga e por finalidade. Pode ser  i) valor  já determinado pelo comitê de bacia; ii) informado pelo usuário através do coeficiente de retorno ou iii) estabelecido pela Portaria Igam n. 79/2021"]
[null,"7. PPUcons: preço público unitário de consumo em R$/m3"]

{"sheet":"CH","index":1,"n_rows":40,"n_cols":8,"rows_kept":40,"cut":false,"hidden":true,"merged":[]}
["SelcioneumaCH","codigo","Bacia cobrada nesse arquivo? 1 = sim e 0 = não","Nome da Bacia","Selecione uma circunscrição hidrográfica","ano inicio da cobrança","ano base inicio do modelo","SelcioneumaCH"]
["CERH",0,{"$f":"IF(F2=0,0,IF(G2<='Valor Captação'!$B$7,1,0))","v":1},"Conselho Estadual de Recursos Hídricos",{"$f":"CONCATENATE(A2,\" - \",D2)","v":"CERH - Conselho Estadual de Recursos Hídricos"},2023,2022,"CERH"]
["DO1",11,{"$f":"IF(F3=0,0,IF(G3<='Valor Captação'!$B$7,1,0))","v":0},"Bacia do Rio Piranga","DO1 - Bacia do Rio Piranga",2012,2024,"DO1"]
["DO2",12,{"$f":"IF(F4=0,0,IF(G4<='Valor Captação'!$B$7,1,0))","v":0},"Bacia do Rio Piracicaba","DO2 - Bacia do Rio Piracicaba",2012,2024,"DO2"]
["DO3",13,{"$f":"IF(F5=0,0,IF(G5<='Valor Captação'!$B$7,1,0))","v":0},"Bacia do Rio Santo Antônio","DO3 - Bacia do Rio Santo Antônio",2012,2024,"DO3"]
["DO4",14,{"$f":"IF(F6=0,0,IF(G6<='Valor Captação'!$B$7,1,0))","v":0},"Bacia do Rio Suaçui Grande","DO4 - Bacia do Rio Suaçui Grande",2012,2024,"DO4"]
["DO5",15,{"$f":"IF(F7=0,0,IF(G7<='Valor Captação'!$B$7,1,0))","v":0},"Bacia do Rio Caratinga","DO5 - Bacia do Rio Caratinga",2012,2024,"DO5"]
["DO6",16,{"$f":"IF(F8=0,0,IF(G8<='Valor Captação'!$B$7,1,0))","v":0},"Bacia do Rio Manhuaçu","DO6 - Bacia do Rio Manhuaçu",2012,2024,"DO6"]
["GD1","01",{"$f":"IF(F9=0,0,IF(G9<='Valor Captação'!$B$7,1,0))","v":1},"Bacia do Alto Rio Grande","GD1 - Bacia do Alto Rio Grande",2023,2023,"GD1"]
["GD2","02",{"$f":"IF(F10=0,0,IF(G10<='Valor Captação'!$B$7,1,0))","v":1},"Bacia Vertentes do Rio Grande","GD2 - Bacia Vertentes do Rio Grande",2022,2022,"GD2"]
["GD3","03",{"$f":"IF(F11=0,0,IF(G11<='Valor Captação'!$B$7,1,0))","v":1},"Bacia do Entorno do Reservatório de Furnas","GD3 - Bacia do Entorno do Reservatório de Furnas",2022,2022,"GD3"]
["GD4","04",{"$f":"IF(F12=0,0,IF(G12<='Valor Captação'!$B$7,1,0))","v":1},"Bacia do Rio Verde","GD4 - Bacia do Rio Verde",2023,2023,"GD4"]
["GD5","05",{"$f":"IF(F13=0,0,IF(G13<='Valor Captação'!$B$7,1,0))","v":1},"Bacia do Rio Sapucaí","GD5 - Bacia do Rio Sapucaí",2023,2023,"GD5"]
["GD6","06",{"$f":"IF(F14=0,0,IF(G14<='Valor Captação'!$B$7,1,0))","v":1},"Bacia dos Afluentes Mineiros dos Rios Mogi-Guaçu / Pardo","GD6 - Bacia dos Afluentes Mineiros dos Rios Mogi-Guaçu / Pardo",2023,2023,"GD6"]
["GD7","07",{"$f":"IF(F15=0,0,IF(G15<='Valor Captação'!$B$7,1,0))","v":1},"Bacia dos Afluentes Mineiros do Médio Grande","GD7 - Bacia dos Afluentes Mineiros do Médio Grande",2023,2023,"GD7"]
["GD8","08",{"$f":"IF(F16=0,0,IF(G16<='Valor Captação'!$B$7,1,0))","v":1},"Bacia dos Afluentes Mineiros do Baixo Grande ","GD8 - Bacia dos Afluentes Mineiros do Baixo Grande ",2023,2023,"GD8"]
["IB1",0,{"$f":"IF(F17=0,0,IF(G17<='Valor Captação'!$B$7,1,0))","v":0},"Afluentes Mineiros dos Rio Preto (Itabopoama), Rio São João e Rio Caparaó","IB1 - Afluentes Mineiros dos Rio Preto (Itabopoama), Rio São João e Rio Caparaó",0,0,"IB1"]
["IN1",0,{"$f":"IF(F18=0,0,IF(G18<='Valor Captação'!$B$7,1,0))","v":0},"Rio Itanhém","IN1 - Rio Itanhém",0,0,"IN1"]
["JQ1",51,{"$f":"IF(F19=0,0,IF(G19<='Valor Captação'!$B$7,1,0))","v":1},"Bacia do Alto Jequitinhonha","JQ1 - Bacia do Alto Jequitinhonha",2023,2023,"JQ1"]
["JQ2",52,{"$f":"IF(F20=0,0,IF(G20<='Valor Captação'!$B$7,1,0))","v":1},"Bacia do Rio Araçuaí","JQ2 - Bacia do Rio Araçuaí",2023,2023,"JQ2"]
["JQ3",53,{"$f":"IF(F21=0,0,IF(G21<='Valor Captação'!$B$7,1,0))","v":0},"Bacia do Médio e Baixo Jequitinhonha","JQ3 - Bacia do Médio e Baixo Jequitinhonha",2024,2024,"JQ3"]
["MU1",61,{"$f":"IF(F22=0,0,IF(G22<='Valor Captação'!$B$7,1,0))","v":1},"Bacia do Rio Mucuri","MU1 - Bacia do Rio Mucuri",2023,2023,"MU1"]
["PA1",71,{"$f":"IF(F23=0,0,IF(G23<='Valor Captação'!$B$7,1,0))","v":0},"Bacia do Rio Mosquito","PA1 - Bacia do Rio Mosquito",2024,2024,"PA1"]
["PJ1",81,{"$f":"IF(F24=0,0,IF(G24<='Valor Captação'!$B$7,1,0))","v":0},"Bacia dos Rios Piracicaba e Jaguari","PJ1 - Bacia dos Rios Piracicaba e Jaguari",2010,2024,"PJ1"]
["PN1",31,{"$f":"IF(F25=0,0,IF(G25<='Valor Captação'!$B$7,1,0))","v":1},"Bacia dos Afluentes Mineiros do Alto Paranaíba","PN1 - Bacia dos Afluentes Mineiros do Alto Paranaíba",2022,2022,"PN1"]
["PN2",32,{"$f":"IF(F26=0,0,IF(G26<='Valor Captação'!$B$7,1,0))","v":1},"Bacia do Rio Araguari","PN2 - Bacia do Rio Araguari",2010,2023,"PN2"]
["PN3",33,{"$f":"IF(F27=0,0,IF(G27<='Valor Captação'!$B$7,1,0))","v":1},"Bacia dos Afluentes Mineiros do Baixo Paranaíba","PN3 - Bacia dos Afluentes Mineiros do Baixo Paranaíba",2022,2022,"PN3"]
["PS1",41,{"$f":"IF(F28=0,0,IF(G28<='Valor Captação'!$B$7,1,0))","v":0},"Bacia dos Afluentes Mineiros dos Rios Preto e Paraibuna","PS1 - Bacia dos Afluentes Mineiros dos Rios Preto e Paraibuna",2014,2024,"PS1"]
["PS2",42,{"$f":"IF(F29=0,0,IF(G29<='Valor Captação'!$B$7,1,0))","v":0},"Bacia dos Afluentes Mineiros dos Rios Pomba e Muriaé","PS2 - Bacia dos Afluentes Mineiros dos Rios Pomba e Muriaé",2014,2024,"PS2"]
["SF1",21,{"$f":"IF(F30=0,0,IF(G30<='Valor Captação'!$B$7,1,0))","v":1},"Bacia dos Afluentes Mineiros do Alto São Francisco","SF1 - Bacia dos Afluentes Mineiros do Alto São Francisco",2023,2023,"SF1"]
["SF10",20,{"$f":"IF(F31=0,0,IF(G31<='Valor Captação'!$B$7,1,0))","v":1},"Bacia dos Afluentes Mineiros do Rio Verde Grande","SF10 - Bacia dos Afluentes Mineiros do Rio Verde Grande",2023,2023,"SF10"]
["SF2",22,{"$f":"IF(F32=0,0,IF(G32<='Valor Captação'!$B$7,1,0))","v":0},"Bacia do Rio Pará","SF2 - Bacia do Rio Pará",2017,2024,"SF2"]
["SF3",23,{"$f":"IF(F33=0,0,IF(G33<='Valor Captação'!$B$7,1,0))","v":1},"Bacia do Rio Paraopeba","SF3 - Bacia do Rio Paraopeba",2022,2022,"SF3"]
["SF4",24,{"$f":"IF(F34=0,0,IF(G34<='Valor Captação'!$B$7,1,0))","v":1},"Bacia do Entorno da Represa de Três Marias","SF4 - Bacia do Entorno da Represa de Três Marias",2023,2023,"SF4"]
["SF5",25,{"$f":"IF(F35=0,0,IF(G35<='Valor Captação'!$B$7,1,0))","v":0},"Bacia do Rio das Velhas","SF5 - Bacia do Rio das Velhas",2010,2024,"SF5"]
["SF6",26,{"$f":"IF(F36=0,0,IF(G36<='Valor Captação'!$B$7,1,0))","v":1},"Bacia dos Rios Jequitaí e Pacuí","SF6 - Bacia dos Rios Jequitaí e Pacuí",2023,2023,"SF6"]
["SF7",27,{"$f":"IF(F37=0,0,IF(G37<='Valor Captação'!$B$7,1,0))","v":1},"Bacia dos Afluentes Mineiros do Rio Paracatu","SF7 - Bacia dos Afluentes Mineiros do Rio Paracatu",2023,2023,"SF7"]
["SF8",28,{"$f":"IF(F38=0,0,IF(G38<='Valor Captação'!$B$7,1,0))","v":1},"Bacia do Rio Urucuia","SF8 - Bacia do Rio Urucuia",2023,2023,"SF8"]
["SF9",29,{"$f":"IF(F39=0,0,IF(G39<='Valor Captação'!$B$7,1,0))","v":1},"Bacia dos Afluentes Mineiros do Médio São Francisco","SF9 - Bacia dos Afluentes Mineiros do Médio São Francisco",2023,2023,"SF9"]
["SM1",91,{"$f":"IF(F40=0,0,IF(G40<='Valor Captação'!$B$7,1,0))","v":1},"Bacia do Rio São Mateus","SM1 - Bacia do Rio São Mateus",2023,2023,"SM1"]

{"sheet":"hora","index":2,"n_rows":12,"n_cols":26,"rows_kept":12,"cut":false,"hidden":true,"merged":[]}
["Rebaixamento","Irrigação"," \nDessedentação","\n(Aquicultura)","Mineração","Industria","Saneamento","Outra Consumo humano","Outra \n(lavagem veículos)","Outra\n(Recirculação)","Outra \n(total)",null,null,"MESES\n(NÃO APAGAR)",1,2,3,4,5,6,7,8,9,10,11,12]
[24,20,20,24,8,20,16,20,2,24,24]
[]
[]
[]
[]
[null,"Rebaixamento","Irrigação","animais","Aqüicultura","extração","Industria","abastecimento","humano","lavagem","recirculação","outra"]
["n. vezes",75,1111,141,56,484,435,225,513,109,17,5213]
["h/dia",24,20,20,24,0,20,16,20,2,0,0]
[]
["n. vezes",10,931,138,20,468,375,128,482,97,12,181]
["h/dia",0,21,2,0,8,24,20,2,8,24,24]

{"sheet":"kirrig","index":3,"n_rows":305,"n_cols":7,"rows_kept":305,"cut":false,"hidden":true,"merged":[]}
[null,"UPGRH","Sistema de irrigação","cap","cons",null,"Gotejamento"]
[null,"DO1","gotejamento",2.5000000000000001E-2,0,null,"Micro aspersão"]
[null,"DO1","micro aspersão",2.5000000000000001E-2,0,null,"Pivô central"]
[null,"DO1","pivô central",2.5000000000000001E-2,0,null,"Tubos perfurados"]
[null,"DO1","tubos perfurados",2.5000000000000001E-2,0,null,"Aspersão convencional"]
[null,"DO1","aspersão convencional",2.5000000000000001E-2,0,null,"Sulcos"]
[null,"DO1","sulcos",2.5000000000000001E-2,0,null,"Inundação"]
[null,"DO1","inundação",2.5000000000000001E-2,0,null,"Outro"]
[null,"DO1","Outro",2.5000000000000001E-2,0]
[null,"DO2","gotejamento",0.05,0]
[null,"DO2","micro aspersão",0.05,0]
[null,"DO2","pivô central",0.05,0]
[null,"DO2","tubos perfurados",0.05,0]
[null,"DO2","aspersão convencional",0.05,0]
[null,"DO2","sulcos",0.05,0]
[null,"DO2","inundação",0.05,0]
[null,"DO2","Outro",0.05,0]
[null,"DO3","gotejamento",2.5000000000000001E-2,0]
[null,"DO3","micro aspersão",2.5000000000000001E-2,0]
[null,"DO3","pivô central",2.5000000000000001E-2,0]
[null,"DO3","tubos perfurados",2.5000000000000001E-2,0]
[null,"DO3","aspersão convencional",2.5000000000000001E-2,0]
[null,"DO3","sulcos",2.5000000000000001E-2,0]
[null,"DO3","inundação",2.5000000000000001E-2,0]
[null,"DO3","Outro",2.5000000000000001E-2,0]
[null,"DO4","gotejamento",2.5000000000000001E-2,0]
[null,"DO4","micro aspersão",2.5000000000000001E-2,0]
[null,"DO4","pivô central",2.5000000000000001E-2,0]
[null,"DO4","tubos perfurados",2.5000000000000001E-2,0]
[null,"DO4","aspersão convencional",2.5000000000000001E-2,0]
[null,"DO4","sulcos",2.5000000000000001E-2,0]
[null,"DO4","inundação",2.5000000000000001E-2,0]
[null,"DO4","Outro",2.5000000000000001E-2,0]
[null,"DO5","gotejamento",2.5000000000000001E-2,0]
[null,"DO5","micro aspersão",2.5000000000000001E-2,0]
[null,"DO5","pivô central",2.5000000000000001E-2,0]
[null,"DO5","tubos perfurados",2.5000000000000001E-2,0]
[null,"DO5","aspersão convencional",2.5000000000000001E-2,0]
[null,"DO5","sulcos",2.5000000000000001E-2,0]
[null,"DO5","inundação",2.5000000000000001E-2,0]
[null,"DO5","Outro",2.5000000000000001E-2,0]
[null,"DO6","gotejamento",0.05,0]
[null,"DO6","micro aspersão",0.05,0]
[null,"DO6","pivô central",0.05,0]
[null,"DO6","tubos perfurados",0.05,0]
[null,"DO6","aspersão convencional",0.05,0]
[null,"DO6","sulcos",0.05,0]
[null,"DO6","inundação",0.05,0]
[null,"DO6","Outro",0.05,0]
[null,"PJ1","gotejamento",5.0000000000000044E-2,0.95]
[null,"PJ1","micro aspersão",9.9999999999999978E-2,0.9]
[null,"PJ1","pivô central",0.15000000000000002,0.85]
[null,"PJ1","tubos perfurados",0.15000000000000002,0.85]
[null,"PJ1","aspersão convencional",0.25,0.75]
[null,"PJ1","sulcos",0.4,0.6]
[null,"PJ1","inundação",0.5,0.5]
[null,"PJ1","Outro",0.5,0.5]
[null,"PN2","gotejamento",5.0000000000000044E-2,0.95]
[null,"PN2","micro aspersão",9.9999999999999978E-2,0.9]
[null,"PN2","pivô central",0.15000000000000002,0.85]
[null,"PN2","tubos perfurados",0.15000000000000002,0.85]
[null,"PN2","aspersão convencional",0.25,0.75]
[null,"PN2","sulcos",0.4,0.6]
[null,"PN2","inundação",0.5,0.5]
[null,"PN2","Outro",0.5,0.5]
[null,"PS1","gotejamento",0.05,0.5]
[null,"PS1","micro aspersão",0.05,0.5]
[null,"PS1","pivô central",0.05,0.5]
[null,"PS1","tubos perfurados",0.05,0.5]
[null,"PS1","aspersão convencional",0.05,0.5]
[null,"PS1","sulcos",0.05,0.5]
[null,"PS1","inundação",0.05,0.5]
[null,"PS1","Outro",0.05,0.5]
[null,"PS2","gotejamento",0.05,0.5]
[null,"PS2","micro aspersão",0.05,0.5]
[null,"PS2","pivô central",0.05,0.5]
[null,"PS2","tubos perfurados",0.05,0.5]
[null,"PS2","aspersão convencional",0.05,0.5]
[null,"PS2","sulcos",0.05,0.5]
[null,"PS2","inundação",0.05,0.5]
[null,"PS2","Outro",0.05,0.5]
[null,"SF2","gotejamento",0.05,0.95]
[null,"SF2","micro aspersão",0.1,0.9]
[null,"SF2","pivô central",0.15,0.85]
[null,"SF2","tubos perfurados",0.15,0.85]
[null,"SF2","aspersão convencional",0.25,0.75]
[null,"SF2","sulcos",0.4,0.6]
[null,"SF2","inundação",0.5,0.5]
[null,"SF2","Outro",0.5,0.5]
[null,"SF5","gotejamento",2.5000000000000001E-2,0.8]
[null,"SF5","micro aspersão",2.5000000000000001E-2,0.8]
[null,"SF5","pivô central",2.5000000000000001E-2,0.8]
[null,"SF5","tubos perfurados",2.5000000000000001E-2,0.8]
[null,"SF5","aspersão convencional",2.5000000000000001E-2,0.8]
[null,"SF5","sulcos",2.5000000000000001E-2,0.8]
[null,"SF5","inundação",2.5000000000000001E-2,0.8]
[null,"SF5","Outro",2.5000000000000001E-2,0.8]
[null,"PN1","gotejamento",1,0]
[null,"PN1","micro aspersão",1,0]
[null,"PN1","pivô central",1,0]
[null,"PN1","tubos perfurados",1,0]
[null,"PN1","aspersão convencional",1,0]
[null,"PN1","sulcos",1,0]
[null,"PN1","inundação",1,0]
[null,"PN1","Outro",1,0]
[null,"PN3","gotejamento",1,0]
[null,"PN3","micro aspersão",1,0]
[null,"PN3","pivô central",1,0]
[null,"PN3","tubos perfurados",1,0]
[null,"PN3","aspersão convencional",1,0]
[null,"PN3","sulcos",1,0]
[null,"PN3","inundação",1,0]
[null,"PN3","Outro",1,0]
[null,"GD3","gotejamento",1,0]
[null,"GD3","micro aspersão",1,0]
[null,"GD3","pivô central",1,0]
[null,"GD3","tubos perfurados",1,0]
[null,"GD3","aspersão convencional",1,0]
[null,"GD3","sulcos",1,0]
[null,"GD3","inundação",1,0]
[null,"GD3","Outro",1,0]
[null,"GD2","gotejamento",1,0]
[null,"GD2","micro aspersão",1,0]
[null,"GD2","pivô central",1,0]
[null,"GD2","tubos perfurados",1,0]
[null,"GD2","aspersão convencional",1,0]
[null,"GD2","sulcos",1,0]
[null,"GD2","inundação",1,0]
[null,"GD2","Outro",1,0]
[null,"SF3","gotejamento",1,0]
[null,"SF3","micro aspersão",1,0]
[null,"SF3","pivô central",1,0]
[null,"SF3","tubos perfurados",1,0]
[null,"SF3","aspersão convencional",1,0]
[null,"SF3","sulcos",1,0]
[null,"SF3","inundação",1,0]
[null,"SF3","Outro",1,0]
[null,"CERH","gotejamento",1,0]
[null,"CERH","micro aspersão",1,0]
[null,"CERH","pivô central",1,0]
[null,"CERH","tubos perfurados",1,0]
[null,"CERH","aspersão convencional",1,0]
[null,"CERH","sulcos",1,0]
[null,"CERH","inundação",1,0]
[null,"CERH","Outro",1,0]
[null,"SF1","gotejamento",1,0]
[null,"SF1","micro aspersão",1,0]
[null,"SF1","pivô central",1,0]
[null,"SF1","tubos perfurados",1,0]
[null,"SF1","aspersão convencional",1,0]
[null,"SF1","sulcos",1,0]
[null,"SF1","inundação",1,0]
[null,"SF1","Outro",1,0]
[null,"SF4","gotejamento",1,0]
[null,"SF4","micro aspersão",1,0]
[null,"SF4","pivô central",1,0]
[null,"SF4","tubos perfurados",1,0]
[null,"SF4","aspersão convencional",1,0]
[null,"SF4","sulcos",1,0]
[null,"SF4","inundação",1,0]
[null,"SF4","Outro",1,0]
[null,"SF6","gotejamento",1,0]
[null,"SF6","micro aspersão",1,0]
[null,"SF6","pivô central",1,0]
[null,"SF6","tubos perfurados",1,0]
[null,"SF6","aspersão convencional",1,0]
[null,"SF6","sulcos",1,0]
[null,"SF6","inundação",1,0]
[null,"SF6","Outro",1,0]
[null,"SF7","gotejamento",1,0]
[null,"SF7","micro aspersão",1,0]
[null,"SF7","pivô central",1,0]
[null,"SF7","tubos perfurados",1,0]
[null,"SF7","aspersão convencional",1,0]
[null,"SF7","sulcos",1,0]
[null,"SF7","inundação",1,0]
[null,"SF7","Outro",1,0]
[null,"SF8","gotejamento",1,0]
[null,"SF8","micro aspersão",1,0]
[null,"SF8","pivô central",1,0]
[null,"SF8","tubos perfurados",1,0]
[null,"SF8","aspersão convencional",1,0]
[null,"SF8","sulcos",1,0]
[null,"SF8","inundação",1,0]
[null,"SF8","Outro",1,0]
[null,"SF9","gotejamento",1,0]
[null,"SF9","micro aspersão",1,0]
[null,"SF9","pivô central",1,0]
[null,"SF9","tubos perfurados",1,0]
[null,"SF9","aspersão convencional",1,0]
[null,"SF9","sulcos",1,0]
[null,"SF9","inundação",1,0]
[null,"SF9","Outro",1,0]
[null,"SF10","gotejamento",1,0]
[null,"SF10","micro aspersão",1,0]
[null,"SF10","pivô central",1,0]
[null,"SF10","tubos perfurados",1,0]
[null,"SF10","aspersão convencional",1,0]
[null,"SF10","sulcos",1,0]
[null,"SF10","inundação",1,0]
[null,"SF10","Outro",1,0]
[null,"GD1","gotejamento",1,0]
[null,"GD1","micro aspersão",1,0]
[null,"GD1","pivô central",1,0]
[null,"GD1","tubos perfurados",1,0]
[null,"GD1","aspersão convencional",1,0]
[null,"GD1","sulcos",1,0]
[null,"GD1","inundação",1,0]
[null,"GD1","Outro",1,0]
[null,"GD4","gotejamento",1,0]
[null,"GD4","micro aspersão",1,0]
[null,"GD4","pivô central",1,0]
[null,"GD4","tubos perfurados",1,0]
[null,"GD4","aspersão convencional",1,0]
[null,"GD4","sulcos",1,0]
[null,"GD4","inundação",1,0]
[null,"GD4","Outro",1,0]
[null,"GD5","gotejamento",1,0]
[null,"GD5","micro aspersão",1,0]
[null,"GD5","pivô central",1,0]
[null,"GD5","tubos perfurados",1,0]
[null,"GD5","aspersão convencional",1,0]
[null,"GD5","sulcos",1,0]
[null,"GD5","inundação",1,0]
[null,"GD5","Outro",1,0]
[null,"GD6","gotejamento",1,0]
[null,"GD6","micro aspersão",1,0]
[null,"GD6","pivô central",1,0]
[null,"GD6","tubos perfurados",1,0]
[null,"GD6","aspersão convencional",1,0]
[null,"GD6","sulcos",1,0]
[null,"GD6","inundação",1,0]
[null,"GD6","Outro",1,0]
[null,"GD7","gotejamento",1,0]
[null,"GD7","micro aspersão",1,0]
[null,"GD7","pivô central",1,0]
[null,"GD7","tubos perfurados",1,0]
[null,"GD7","aspersão convencional",1,0]
[null,"GD7","sulcos",1,0]
[null,"GD7","inundação",1,0]
[null,"GD7","Outro",1,0]
[null,"GD8","gotejamento",1,0]
[null,"GD8","micro aspersão",1,0]
[null,"GD8","pivô central",1,0]
[null,"GD8","tubos perfurados",1,0]
[null,"GD8","aspersão convencional",1,0]
[null,"GD8","sulcos",1,0]
[null,"GD8","inundação",1,0]
[null,"GD8","Outro",1,0]
[null,"JQ1","gotejamento",1,0]
[null,"JQ1","micro aspersão",1,0]
[null,"JQ1","pivô central",1,0]
[null,"JQ1","tubos perfurados",1,0]
[null,"JQ1","aspersão convencional",1,0]
[null,"JQ1","sulcos",1,0]
[null,"JQ1","inundação",1,0]
[null,"JQ1","Outro",1,0]
[null,"JQ2","gotejamento",1,0]
[null,"JQ2","micro aspersão",1,0]
[null,"JQ2","pivô central",1,0]
[null,"JQ2","tubos perfurados",1,0]
[null,"JQ2","aspersão convencional",1,0]
[null,"JQ2","sulcos",1,0]
[null,"JQ2","inundação",1,0]
[null,"JQ2","Outro",1,0]
[null,"JQ3","gotejamento",1,0]
[null,"JQ3","micro aspersão",1,0]
[null,"JQ3","pivô central",1,0]
[null,"JQ3","tubos perfurados",1,0]
[null,"JQ3","aspersão convencional",1,0]
[null,"JQ3","sulcos",1,0]
[null,"JQ3","inundação",1,0]
[null,"JQ3","Outro",1,0]
[null,"PA1","gotejamento",1,0]
[null,"PA1","micro aspersão",1,0]
[null,"PA1","pivô central",1,0]
[null,"PA1","tubos perfurados",1,0]
[null,"PA1","aspersão convencional",1,0]
[null,"PA1","sulcos",1,0]
[null,"PA1","inundação",1,0]
[null,"PA1","Outro",1,0]
[null,"MU1","gotejamento",1,0]
[null,"MU1","micro aspersão",1,0]
[null,"MU1","pivô central",1,0]
[null,"MU1","tubos perfurados",1,0]
[null,"MU1","aspersão convencional",1,0]
[null,"MU1","sulcos",1,0]
[null,"MU1","inundação",1,0]
[null,"MU1","Outro",1,0]
[null,"SM1","gotejamento",1,0]
[null,"SM1","micro aspersão",1,0]
[null,"SM1","pivô central",1,0]
[null,"SM1","tubos perfurados",1,0]
[null,"SM1","aspersão convencional",1,0]
[null,"SM1","sulcos",1,0]
[null,"SM1","inundação",1,0]
[null,"SM1","Outro",1,0]
[null,null,"gotejamento",1,0]
[null,null,"micro aspersão",1,0]
[null,null,"pivô central",1,0]
[null,null,"tubos perfurados",1,0]
[null,null,"aspersão convencional",1,0]
[null,null,"sulcos",1,0]
[null,null,"inundação",1,0]
[null,null,"Outro",1,0]

{"sheet":"kfin","index":4,"n_rows":38,"n_cols":5,"rows_kept":38,"cut":false,"hidden":true,"merged":[]}
[null,"UPGRH","krural","mineração","rebaixamento"]
[null,"DO1",2.5000000000000001E-2,1,1]
[null,"DO2",0.05,1,1]
[null,"DO3",2.5000000000000001E-2,1,1]
[null,"DO4",2.5000000000000001E-2,1,1]
[null,"DO5",2.5000000000000001E-2,1,1]
[null,"DO6",0.05,1,1]
[null,"PJ1",0.1,1,1]
[null,"PN2",0.1,1,1]
[null,"PS1",0.05,1,1]
[null,"PS2",0.05,1,1]
[null,"SF2",0.15,1,1]
[null,"SF5",2.5000000000000001E-2,0.75,0.5]
[null,"GD2",1,1,1]
[null,"GD3",1,1,1]
[null,"PN1",1,1,1]
[null,"PN3",1,1,1]
[null,"SF3",1,1,1]
[null,"CERH",1,1,1]
[null,"GD1",1,1,1]
[null,"GD4",1,1,1]
[null,"GD5",1,1,1]
[null,"GD6",1,1,1]
[null,"GD7",1,1,1]
[null,"GD8",1,1,1]
[null,"SF1",1,1,1]
[null,"SF4",1,1,1]
[null,"SF6",1,1,1]
[null,"SF7",1,1,1]
[null,"SF8",1,1,1]
[null,"SF9",1,1,1]
[null,"SF10",1,1,1]
[null,"SM1",1,1,1]
[null,"MU1",1,1,1]
[null,"JQ1",1,1,1]
[null,"JQ2",1,1,1]
[null,"JQ3",1,1,1]
[null,"PA1",1,1,1]

{"sheet":"kclasse","index":5,"n_rows":241,"n_cols":4,"rows_kept":241,"cut":false,"hidden":true,"merged":[]}
[null,"UPGRH","Classe","kclasse"]
[null,"DO1",0,1.1499999999999999]
[null,"DO1",1,1.1000000000000001]
[null,"DO1",2,1]
[null,"DO1",3,0.9]
[null,"DO1",4,0.8]
[null,"DO1",9,1]
[null,"DO2",0,1.1499999999999999]
[null,"DO2",1,1.1000000000000001]
[null,"DO2",2,1]
[null,"DO2",3,0.9]
[null,"DO2",4,0.8]
[null,"DO2",9,1]
[null,"DO3",0,1.1499999999999999]
[null,"DO3",1,1.1000000000000001]
[null,"DO3",2,1]
[null,"DO3",3,0.9]
[null,"DO3",4,0.8]
[null,"DO3",9,1]
[null,"DO4",0,1.1499999999999999]
[null,"DO4",1,1.1000000000000001]
[null,"DO4",2,1]
[null,"DO4",3,0.9]
[null,"DO4",4,0.8]
[null,"DO4",9,1]
[null,"DO5",0,1.1499999999999999]
[null,"DO5",1,1.1000000000000001]
[null,"DO5",2,1]
[null,"DO5",3,0.9]
[null,"DO5",4,0.8]
[null,"DO5",9,1]
[null,"DO6",0,1.1499999999999999]
[null,"DO6",1,1.1000000000000001]
[null,"DO6",2,1]
[null,"DO6",3,0.9]
[null,"DO6",4,0.8]
[null,"DO6",9,1]
[null,"GD1",0,1]
[null,"GD1",1,1]
[null,"GD1",2,1]
[null,"GD1",3,1]
[null,"GD1",4,1]
[null,"GD1",9,1]
[null,"GD2",0,1]
[null,"GD2",1,1]
[null,"GD2",2,1]
[null,"GD2",3,1]
[null,"GD2",4,1]
[null,"GD2",9,1]
[null,"GD3",0,1]
[null,"GD3",1,1]
[null,"GD3",2,1]
[null,"GD3",3,1]
[null,"GD3",4,1]
[null,"GD3",9,1]
[null,"GD4",0,1]
[null,"GD4",1,1]
[null,"GD4",2,1]
[null,"GD4",3,1]
[null,"GD4",4,1]
[null,"GD4",9,1]
[null,"GD5",0,1]
[null,"GD5",1,1]
[null,"GD5",2,1]
[null,"GD5",3,1]
[null,"GD5",4,1]
[null,"GD5",9,1]
[null,"GD6",0,1]
[null,"GD6",1,1]
[null,"GD6",2,1]
[null,"GD6",3,1]
[null,"GD6",4,1]
[null,"GD6",9,1]
[null,"GD7",0,1]
[null,"GD7",1,1]
[null,"GD7",2,1]
[null,"GD7",3,1]
[null,"GD7",4,1]
[null,"GD7",9,1]
[null,"GD8",0,1]
[null,"GD8",1,1]
[null,"GD8",2,1]
[null,"GD8",3,1]
[null,"GD8",4,1]
[null,"GD8",9,1]
[null,"IB1",0,1]
[null,"IB1",1,1]
[null,"IB1",2,1]
[null,"IB1",3,1]
[null,"IB1",4,1]
[null,"IB1",9,1]
[null,"IN1",0,1]
[null,"IN1",1,1]
[null,"IN1",2,1]
[null,"IN1",3,1]
[null,"IN1",4,1]
[null,"IN1",9,1]
[null,"IU1",0,1]
[null,"IU1",1,1]
[null,"IU1",2,1]
[null,"IU1",3,1]
[null,"IU1",4,1]
[null,"IU1",9,1]
[null,"JQ1",0,1]
[null,"JQ1",1,1]
[null,"JQ1",2,1]
[null,"JQ1",3,1]
[null,"JQ1",4,1]
[null,"JQ1",9,1]
[null,"JQ2",0,1]
[null,"JQ2",1,1]
[null,"JQ2",2,1]
[null,"JQ2",3,1]
[null,"JQ2",4,1]
[null,"JQ2",9,1]
[null,"JQ3",0,1]
[null,"JQ3",1,1]
[null,"JQ3",2,1]
[null,"JQ3",3,1]
[null,"JQ3",4,1]
[null,"JQ3",9,1]
[null,"MU1",0,1]
[null,"MU1",1,1]
[null,"MU1",2,1]
[null,"MU1",3,1]
[null,"MU1",4,1]
[null,"MU1",9,1]
[null,"PA1",0,1]
[null,"PA1",1,1]
[null,"PA1",2,1]
[null,"PA1",3,1]
[null,"PA1",4,1]
[null,"PA1",9,1]
[null,"PJ1",0,1]
[null,"PJ1",1,1]
[null,"PJ1",2,0.9]
[null,"PJ1",3,0.9]
[null,"PJ1",4,0.7]
[null,"PJ1",9,1]
[null,"PN1",0,1]
[null,"PN1",1,1]
[null,"PN1",2,1]
[null,"PN1",3,1]
[null,"PN1",4,1]
[null,"PN1",9,1]
[null,"PN2",0,1]
[null,"PN2",1,1]
[null,"PN2",2,0.9]
[null,"PN2",3,0.9]
[null,"PN2",4,0.7]
[null,"PN2",9,1]
[null,"PN3",0,1]
[null,"PN3",1,1]
[null,"PN3",2,1]
[null,"PN3",3,1]
[null,"PN3",4,1]
[null,"PN3",9,1]
[null,"PS1",0,1]
[null,"PS1",1,1]
[null,"PS1",2,0.9]
[null,"PS1",3,0.9]
[null,"PS1",4,0.7]
[null,"PS1",9,1.2]
[null,"PS2",0,1]
[null,"PS2",1,1]
[null,"PS2",2,0.9]
[null,"PS2",3,0.9]
[null,"PS2",4,0.7]
[null,"PS2",9,1.1499999999999999]
[null,"SF1",0,1]
[null,"SF1",1,1]
[null,"SF1",2,1]
[null,"SF1",3,1]
[null,"SF1",4,1]
[null,"SF1",9,1]
[null,"SF2",0,1.1000000000000001]
[null,"SF2",1,1.1000000000000001]
[null,"SF2",2,1]
[null,"SF2",3,0.9]
[null,"SF2",4,0.8]
[null,"SF2",9,1.1499999999999999]
[null,"SF3",0,1]
[null,"SF3",1,1]
[null,"SF3",2,1]
[null,"SF3",3,1]
[null,"SF3",4,1]
[null,"SF3",9,1]
[null,"SF4",0,1]
[null,"SF4",1,1]
[null,"SF4",2,1]
[null,"SF4",3,1]
[null,"SF4",4,1]
[null,"SF4",9,1]
[null,"SF5",0,1.1000000000000001]
[null,"SF5",1,1.1000000000000001]
[null,"SF5",2,1]
[null,"SF5",3,0.9]
[null,"SF5",4,0.8]
[null,"SF5",9,1.1499999999999999]
[null,"SF6",0,1]
[null,"SF6",1,1]
[null,"SF6",2,1]
[null,"SF6",3,1]
[null,"SF6",4,1]
[null,"SF6",9,1]
[null,"SF7",0,1]
[null,"SF7",1,1]
[null,"SF7",2,1]
[null,"SF7",3,1]
[null,"SF7",4,1]
[null,"SF7",9,1]
[null,"SF8",0,1]
[null,"SF8",1,1]
[null,"SF8",2,1]
[null,"SF8",3,1]
[null,"SF8",4,1]
[null,"SF8",9,1]
[null,"SF9",0,1]
[null,"SF9",1,1]
[null,"SF9",2,1]
[null,"SF9",3,1]
[null,"SF9",4,1]
[null,"SF9",9,1]
[null,"SF10",0,1]
[null,"SF10",1,1]
[null,"SF10",2,1]
[null,"SF10",3,1]
[null,"SF10",4,1]
[null,"SF10",9,1]
[null,"SM1",0,1]
[null,"SM1",1,1]
[null,"SM1",2,1]
[null,"SM1",3,1]
[null,"SM1",4,1]
[null,"SM1",9,1]
[null,"CERH",0,1]
[null,"CERH",1,1]
[null,"CERH",2,1]
[null,"CERH",3,1]
[null,"CERH",4,1]
[null,"CERH",9,1]

{"sheet":"ppu","index":6,"n_rows":410,"n_cols":21,"rows_kept":410,"cut":false,"hidden":true,"merged":[]}
["ANO","CH","TIPO/ZONA","PPU CAP "," PPU CONS "," PPU TRANSP "," PPU LANC "," PPUcap Saneamento <100.000hab "," ppu cap saneamento >= 100.000 hab "," PPUcap Rural"," PPUcap irrigacao <=250.000m3"," ppu cap irrigacao >250.000m3"," PPU cap rebaixamento p/ mineraCAo "," PPU cap Industria"," PPUcap demais finalidades ","Faixa tratamento esgoto saneamento","  PPUlanc Saneamento (< 100mil hab sede urbana) ","  PPUlanc Saneamento (>=100mil hab sede urbana) ","  PPU lanC AgropecuAria  ","ppu lanç Industria","  PPU lanC demais finalidades  "]
[2010,"PJ1","SUBTERRANEO",1.15E-2,0.02,0,0.1,0,0,0,0,0,0,0,0,0,0,0,0,0,0]
[2010,"PJ1","SUPERFICIAL",0.01,0.02,0,0.1,0,0,0,0,0,0,0,0,0,0,0,0,0,0]
[2010,"PN2","SUBTERRANEO",1.15E-2,0.02,0,0.1,0,0,0,0,0,0,0,0,0,0,0,0,0,0]
[2010,"PN2","SUPERFICIAL",0.01,0.02,0,0.1,0,0,0,0,0,0,0,0,0,0,0,0,0,0]
[2010,"SF5","SUBTERRANEO",0.01,0.02,0,7.0000000000000007E-2,0,0,0,0,0,0,0,0,0,0,0,0,0,0]
[2010,"SF5","SUPERFICIAL",0.01,0.02,0,7.0000000000000007E-2,0,0,0,0,0,0,0,0,0,0,0,0,0,0]
[2011,"PJ1","SUBTERRANEO",1.15E-2,0.02,0,0.1,0,0,0,0,0,0,0,0,0,0,0,0,0,0]
[2011,"PJ1","SUPERFICIAL",0.01,0.02,0,0.1,0,0,0,0,0,0,0,0,0,0,0,0,0,0]
[2011,"PN2","SUBTERRANEO",1.15E-2,0.02,0,0.1,0,0,0,0,0,0,0,0,0,0,0,0,0,0]
[2011,"PN2","SUPERFICIAL",0.01,0.02,0,0.1,0,0,0,0,0,0,0,0,0,0,0,0,0,0]
[2011,"SF5","SUBTERRANEO",0.01,0.02,0,7.0000000000000007E-2,0,0,0,0,0,0,0,0,0,0,0,0,0,0]
[2011,"SF5","SUPERFICIAL",0.01,0.02,0,7.0000000000000007E-2,0,0,0,0,0,0,0,0,0,0,0,0,0,0]
[2012,"DO1","SUBTERRANEO",2.1000000000000001E-2,0,2.1999999999999999E-2,0,0,0,0,0,0,0,0,0,0,0,0,0,0,0]
[2012,"DO1","SUPERFICIAL",1.7999999999999999E-2,0,2.1999999999999999E-2,0.1,0,0,0,0,0,0,0,0,0,0,0,0,0,0]
[2012,"DO2","SUBTERRANEO",0.02,0,2.1999999999999999E-2,0,0,0,0,0,0,0,0,0,0,0,0,0,0,0]
[2012,"DO2","SUPERFICIAL",1.7999999999999999E-2,0,2.1999999999999999E-2,0.1,0,0,0,0,0,0,0,0,0,0,0,0,0,0]
[2012,"DO3","SUBTERRANEO",0.02,0,2.1999999999999999E-2,0,0,0,0,0,0,0,0,0,0,0,0,0,0,0]
[2012,"DO3","SUPERFICIAL",1.7999999999999999E-2,0,2.1999999999999999E-2,0.16,0,0,0,0,0,0,0,0,0,0,0,0,0,0]
[2012,"DO4","SUBTERRANEO",2.1000000000000001E-2,0,2.1999999999999999E-2,0,0,0,0,0,0,0,0,0,0,0,0,0,0,0]
[2012,"DO4","SUPERFICIAL",1.7999999999999999E-2,0,2.1999999999999999E-2,0.1,0,0,0,0,0,0,0,0,0,0,0,0,0,0]
[2012,"DO5","SUBTERRANEO",0.02,0,2.1999999999999999E-2,0,0,0,0,0,0,0,0,0,0,0,0,0,0,0]
[2012,"DO5","SUPERFICIAL",1.7999999999999999E-2,0,2.1999999999999999E-2,0.1,0,0,0,0,0,0,0,0,0,0,0,0,0,0]
[2012,"DO6","SUBTERRANEO",0.02,0,2.1999999999999999E-2,0,0,0,0,0,0,0,0,0,0,0,0,0,0,0]
[2012,"DO6","SUPERFICIAL",1.7999999999999999E-2,0,2.1999999999999999E-2,0.1,0,0,0,0,0,0,0,0,0,0,0,0,0,0]
[2012,"PJ1","SUBTERRANEO",1.15E-2,0.02,0,0.1,0,0,0,0,0,0,0,0,0,0,0,0,0,0]
[2012,"PJ1","SUPERFICIAL",0.01,0.02,0,0.1,0,0,0,0,0,0,0,0,0,0,0,0,0,0]
[2012,"PN2","SUBTERRANEO",1.15E-2,0.02,0,0.1,0,0,0,0,0,0,0,0,0,0,0,0,0,0]
[2012,"PN2","SUPERFICIAL",0.01,0.02,0,0.1,0,0,0,0,0,0,0,0,0,0,0,0,0,0]
[2012,"SF5","SUBTERRANEO",0.01,0.02,0,7.0000000000000007E-2,0,0,0,0,0,0,0,0,0,0,0,0,0,0]
[2012,"SF5","SUPERFICIAL",0.01,0.02,0,7.0000000000000007E-2,0,0,0,0,0,0,0,0,0,0,0,0,0,0]
[2013,"DO1","SUBTERRANEO",2.4E-2,0,2.7E-2,0,0,0,0,0,0,0,0,0,0,0,0,0,0,0]
[2013,"DO1","SUPERFICIAL",2.1000000000000001E-2,0,2.7E-2,0.12,0,0,0,0,0,0,0,0,0,0,0,0,0,0]
[2013,"DO2","SUBTERRANEO",2.3E-2,0,2.7E-2,0,0,0,0,0,0,0,0,0,0,0,0,0,0,0]
[2013,"DO2","SUPERFICIAL",2.1000000000000001E-2,0,2.7E-2,0.12,0,0,0,0,0,0,0,0,0,0,0,0,0,0]
[2013,"DO3","SUBTERRANEO",2.3E-2,0,2.7E-2,0,0,0,0,0,0,0,0,0,0,0,0,0,0,0]
[2013,"DO3","SUPERFICIAL",2.1000000000000001E-2,0,2.7E-2,0.12,0,0,0,0,0,0,0,0,0,0,0,0,0,0]
[2013,"DO4","SUBTERRANEO",2.4E-2,0,2.7E-2,0,0,0,0,0,0,0,0,0,0,0,0,0,0,0]
[2013,"DO4","SUPERFICIAL",2.1000000000000001E-2,0,2.7E-2,0.12,0,0,0,0,0,0,0,0,0,0,0,0,0,0]
[2013,"DO5","SUBTERRANEO",2.3E-2,0,2.7E-2,0,0,0,0,0,0,0,0,0,0,0,0,0,0,0]
[2013,"DO5","SUPERFICIAL",2.1000000000000001E-2,0,2.7E-2,0.12,0,0,0,0,0,0,0,0,0,0,0,0,0,0]
[2013,"DO6","SUBTERRANEO",2.3E-2,0,2.7E-2,0,0,0,0,0,0,0,0,0,0,0,0,0,0,0]
[2013,"DO6","SUPERFICIAL",2.1000000000000001E-2,0,2.7E-2,0.12,0,0,0,0,0,0,0,0,0,0,0,0,0,0]
[2013,"PJ1","SUBTERRANEO",1.15E-2,0.02,0,0.1,0,0,0,0,0,0,0,0,0,0,0,0,0,0]
[2013,"PJ1","SUPERFICIAL",0.01,0.02,0,0.1,0,0,0,0,0,0,0,0,0,0,0,0,0,0]
[2013,"PN2","SUBTERRANEO",1.15E-2,0.02,0,0.1,0,0,0,0,0,0,0,0,0,0,0,0,0,0]
[2013,"PN2","SUPERFICIAL",0.01,0.02,0,0.1,0,0,0,0,0,0,0,0,0,0,0,0,0,0]
[2013,"SF5","SUBTERRANEO",0.01,0.02,0,7.0000000000000007E-2,0,0,0,0,0,0,0,0,0,0,0,0,0,0]
[2013,"SF5","SUPERFICIAL",0.01,0.02,0,7.0000000000000007E-2,0,0,0,0,0,0,0,0,0,0,0,0,0,0]
[2014,"DO1","SUBTERRANEO",2.4E-2,0,2.7E-2,0,0,0,0,0,0,0,0,0,0,0,0,0,0,0]
[2014,"DO1","SUPERFICIAL",2.1000000000000001E-2,0,2.7E-2,0.12,0,0,0,0,0,0,0,0,0,0,0,0,0,0]
[2014,"DO2","SUBTERRANEO",2.3E-2,0,2.7E-2,0,0,0,0,0,0,0,0,0,0,0,0,0,0,0]
[2014,"DO2","SUPERFICIAL",2.1000000000000001E-2,0,2.7E-2,0.12,0,0,0,0,0,0,0,0,0,0,0,0,0,0]
[2014,"DO3","SUBTERRANEO",2.3E-2,0,2.7E-2,0,0,0,0,0,0,0,0,0,0,0,0,0,0,0]
[2014,"DO3","SUPERFICIAL",2.1000000000000001E-2,0,2.7E-2,0.12,0,0,0,0,0,0,0,0,0,0,0,0,0,0]
[2014,"DO4","SUBTERRANEO",2.4E-2,0,2.7E-2,0,0,0,0,0,0,0,0,0,0,0,0,0,0,0]
[2014,"DO4","SUPERFICIAL",2.1000000000000001E-2,0,2.7E-2,0.12,0,0,0,0,0,0,0,0,0,0,0,0,0,0]
[2014,"DO5","SUBTERRANEO",2.3E-2,0,2.7E-2,0,0,0,0,0,0,0,0,0,0,0,0,0,0,0]
[2014,"DO5","SUPERFICIAL",2.1000000000000001E-2,0,2.7E-2,0.12,0,0,0,0,0,0,0,0,0,0,0,0,0,0]
[2014,"DO6","SUBTERRANEO",2.3E-2,0,2.7E-2,0,0,0,0,0,0,0,0,0,0,0,0,0,0,0]
[2014,"DO6","SUPERFICIAL",2.1000000000000001E-2,0,2.7E-2,0.12,0,0,0,0,0,0,0,0,0,0,0,0,0,0]
[2014,"PJ1","SUBTERRANEO",1.15E-2,0.02,0,0.1,0,0,0,0,0,0,0,0,0,0,0,0,0,0]
[2014,"PJ1","SUPERFICIAL",0.01,0.02,0,0.1,0,0,0,0,0,0,0,0,0,0,0,0,0,0]
[2014,"PN2","SUBTERRANEO",1.15E-2,0.02,0,0.1,0,0,0,0,0,0,0,0,0,0,0,0,0,0]
[2014,"PN2","SUPERFICIAL",0.01,0.02,0,0.1,0,0,0,0,0,0,0,0,0,0,0,0,0,0]
[2014,"PS1","SUBTERRANEO",0.01,0.02,1.4999999999999999E-2,7.0000000000000007E-2,0,0,0,0,0,0,0,0,0,0,0,0,0,0]
[2014,"PS1","SUPERFICIAL",0.01,0.02,1.4999999999999999E-2,7.0000000000000007E-2,0,0,0,0,0,0,0,0,0,0,0,0,0,0]
[2014,"PS2","SUBTERRANEO",0.01,0.02,1.4999999999999999E-2,7.0000000000000007E-2,0,0,0,0,0,0,0,0,0,0,0,0,0,0]
[2014,"PS2","SUPERFICIAL",0.01,0.02,1.4999999999999999E-2,7.0000000000000007E-2,0,0,0,0,0,0,0,0,0,0,0,0,0,0]
[2014,"SF5","SUBTERRANEO",0.01,0.02,0,7.0000000000000007E-2,0,0,0,0,0,0,0,0,0,0,0,0,0,0]
[2014,"SF5","SUPERFICIAL",0.01,0.02,0,7.0000000000000007E-2,0,0,0,0,0,0,0,0,0,0,0,0,0,0]
[2015,"DO1","SUBTERRANEO",3.5000000000000003E-2,0,0.04,0,0,0,0,0,0,0,0,0,0,0,0,0,0,0]
[2015,"DO1","SUPERFICIAL",0.03,0,0.04,0.16,0,0,0,0,0,0,0,0,0,0,0,0,0,0]
[2015,"DO2","SUBTERRANEO",3.3000000000000002E-2,0,0.04,0,0,0,0,0,0,0,0,0,0,0,0,0,0,0]
[2015,"DO2","SUPERFICIAL",0.03,0,0.04,0.16,0,0,0,0,0,0,0,0,0,0,0,0,0,0]
[2015,"DO3","SUBTERRANEO",3.3000000000000002E-2,0,0.04,0,0,0,0,0,0,0,0,0,0,0,0,0,0,0]
[2015,"DO3","SUPERFICIAL",0.03,0,0.04,0.16,0,0,0,0,0,0,0,0,0,0,0,0,0,0]
[2015,"DO4","SUBTERRANEO",3.5000000000000003E-2,0,0.04,0,0,0,0,0,0,0,0,0,0,0,0,0,0,0]
[2015,"DO4","SUPERFICIAL",0.03,0,0.04,0.16,0,0,0,0,0,0,0,0,0,0,0,0,0,0]
[2015,"DO5","SUBTERRANEO",3.3000000000000002E-2,0,0.04,0,0,0,0,0,0,0,0,0,0,0,0,0,0,0]
[2015,"DO5","SUPERFICIAL",0.03,0,0.04,0.16,0,0,0,0,0,0,0,0,0,0,0,0,0,0]
[2015,"DO6","SUBTERRANEO",3.3000000000000002E-2,0,0.04,0,0,0,0,0,0,0,0,0,0,0,0,0,0,0]
[2015,"DO6","SUPERFICIAL",0.03,0,0.04,0.16,0,0,0,0,0,0,0,0,0,0,0,0,0,0]
[2015,"PJ1","SUBTERRANEO",1.15E-2,0.02,0,0.1,0,0,0,0,0,0,0,0,0,0,0,0,0,0]
[2015,"PJ1","SUPERFICIAL",0.01,0.02,0,0.1,0,0,0,0,0,0,0,0,0,0,0,0,0,0]
[2015,"PN2","SUBTERRANEO",1.15E-2,0.02,0,0.1,0,0,0,0,0,0,0,0,0,0,0,0,0,0]
[2015,"PN2","SUPERFICIAL",0.01,0.02,0,0.1,0,0,0,0,0,0,0,0,0,0,0,0,0,0]
[2015,"PS1","SUBTERRANEO",0.01,0.02,1.4999999999999999E-2,7.0000000000000007E-2,0,0,0,0,0,0,0,0,0,0,0,0,0,0]
[2015,"PS1","SUPERFICIAL",0.01,0.02,1.4999999999999999E-2,7.0000000000000007E-2,0,0,0,0,0,0,0,0,0,0,0,0,0,0]
[2015,"PS2","SUBTERRANEO",0.01,0.02,1.4999999999999999E-2,7.0000000000000007E-2,0,0,0,0,0,0,0,0,0,0,0,0,0,0]
[2015,"PS2","SUPERFICIAL",0.01,0.02,1.4999999999999999E-2,7.0000000000000007E-2,0,0,0,0,0,0,0,0,0,0,0,0,0,0]
[2015,"SF5","SUBTERRANEO",0.01,0.02,0,7.0000000000000007E-2,0,0,0,0,0,0,0,0,0,0,0,0,0,0]
[2015,"SF5","SUPERFICIAL",0.01,0.02,0,7.0000000000000007E-2,0,0,0,0,0,0,0,0,0,0,0,0,0,0]
[2016,"DO1","SUBTERRANEO",3.5000000000000003E-2,0,0.04,0,0,0,0,0,0,0,0,0,0,0,0,0,0,0]
[2016,"DO1","SUPERFICIAL",0.03,0,0.04,0.16,0,0,0,0,0,0,0,0,0,0,0,0,0,0]
[2016,"DO2","SUBTERRANEO",3.3000000000000002E-2,0,0.04,0,0,0,0,0,0,0,0,0,0,0,0,0,0,0]
[2016,"DO2","SUPERFICIAL",0.03,0,0.04,0.16,0,0,0,0,0,0,0,0,0,0,0,0,0,0]
[2016,"DO3","SUBTERRANEO",3.3000000000000002E-2,0,0.04,0,0,0,0,0,0,0,0,0,0,0,0,0,0,0]
[2016,"DO3","SUPERFICIAL",0.03,0,0.04,0.16,0,0,0,0,0,0,0,0,0,0,0,0,0,0]
[2016,"DO4","SUBTERRANEO",3.5000000000000003E-2,0,0.04,0,0,0,0,0,0,0,0,0,0,0,0,0,0,0]
[2016,"DO4","SUPERFICIAL",0.03,0,0.04,0.16,0,0,0,0,0,0,0,0,0,0,0,0,0,0]
[2016,"DO5","SUBTERRANEO",3.3000000000000002E-2,0,0.04,0,0,0,0,0,0,0,0,0,0,0,0,0,0,0]
[2016,"DO5","SUPERFICIAL",0.03,0,0.04,0.16,0,0,0,0,0,0,0,0,0,0,0,0,0,0]
[2016,"DO6","SUBTERRANEO",3.3000000000000002E-2,0,0.04,0,0,0,0,0,0,0,0,0,0,0,0,0,0,0]
[2016,"DO6","SUPERFICIAL",0.03,0,0.04,0.16,0,0,0,0,0,0,0,0,0,0,0,0,0,0]
[2016,"PJ1","SUBTERRANEO",1.15E-2,0.02,0,0.1,0,0,0,0,0,0,0,0,0,0,0,0,0,0]
[2016,"PJ1","SUPERFICIAL",0.01,0.02,0,0.1,0,0,0,0,0,0,0,0,0,0,0,0,0,0]
[2016,"PN2","SUBTERRANEO",1.15E-2,0.02,0,0.1,0,0,0,0,0,0,0,0,0,0,0,0,0,0]
[2016,"PN2","SUPERFICIAL",0.01,0.02,0,0.1,0,0,0,0,0,0,0,0,0,0,0,0,0,0]
[2016,"PS1","SUBTERRANEO",0.01,0.02,1.4999999999999999E-2,7.0000000000000007E-2,0,0,0,0,0,0,0,0,0,0,0,0,0,0]
[2016,"PS1","SUPERFICIAL",0.01,0.02,1.4999999999999999E-2,7.0000000000000007E-2,0,0,0,0,0,0,0,0,0,0,0,0,0,0]
[2016,"PS2","SUBTERRANEO",0.01,0.02,1.4999999999999999E-2,7.0000000000000007E-2,0,0,0,0,0,0,0,0,0,0,0,0,0,0]
[2016,"PS2","SUPERFICIAL",0.01,0.02,1.4999999999999999E-2,7.0000000000000007E-2,0,0,0,0,0,0,0,0,0,0,0,0,0,0]
[2016,"SF5","SUBTERRANEO",0.01,0.02,0,7.0000000000000007E-2,0,0,0,0,0,0,0,0,0,0,0,0,0,0]
[2016,"SF5","SUPERFICIAL",0.01,0.02,0,7.0000000000000007E-2,0,0,0,0,0,0,0,0,0,0,0,0,0,0]
[2017,"DO1","SUBTERRANEO",3.5000000000000003E-2,0,0.04,0,0,0,0,0,0,0,0,0,0,0,0,0,0,0]
[2017,"DO1","SUPERFICIAL",0.03,0,0.04,0.16,0,0,0,0,0,0,0,0,0,0,0,0,0,0]
[2017,"DO2","SUBTERRANEO",3.3000000000000002E-2,0,0.04,0,0,0,0,0,0,0,0,0,0,0,0,0,0,0]
[2017,"DO2","SUPERFICIAL",0.03,0,0.04,0.16,0,0,0,0,0,0,0,0,0,0,0,0,0,0]
[2017,"DO3","SUBTERRANEO",3.3000000000000002E-2,0,0.04,0,0,0,0,0,0,0,0,0,0,0,0,0,0,0]
[2017,"DO3","SUPERFICIAL",0.03,0,0.04,0.16,0,0,0,0,0,0,0,0,0,0,0,0,0,0]
[2017,"DO4","SUBTERRANEO",3.5000000000000003E-2,0,0.04,0,0,0,0,0,0,0,0,0,0,0,0,0,0,0]
[2017,"DO4","SUPERFICIAL",0.03,0,0.04,0.16,0,0,0,0,0,0,0,0,0,0,0,0,0,0]
[2017,"DO5","SUBTERRANEO",3.3000000000000002E-2,0,0.04,0,0,0,0,0,0,0,0,0,0,0,0,0,0,0]
[2017,"DO5","SUPERFICIAL",0.03,0,0.04,0.16,0,0,0,0,0,0,0,0,0,0,0,0,0,0]
[2017,"DO6","SUBTERRANEO",3.3000000000000002E-2,0,0.04,0,0,0,0,0,0,0,0,0,0,0,0,0,0,0]
[2017,"DO6","SUPERFICIAL",0.03,0,0.04,0.16,0,0,0,0,0,0,0,0,0,0,0,0,0,0]
[2017,"PJ1","SUBTERRANEO",1.15E-2,0.02,0,0.1,0,0,0,0,0,0,0,0,0,0,0,0,0,0]
[2017,"PJ1","SUPERFICIAL",0.01,0.02,0,0.1,0,0,0,0,0,0,0,0,0,0,0,0,0,0]
[2017,"PN2","SUBTERRANEO",1.15E-2,0.02,0,0.1,0,0,0,0,0,0,0,0,0,0,0,0,0,0]
[2017,"PN2","SUPERFICIAL",0.01,0.02,0,0.1,0,0,0,0,0,0,0,0,0,0,0,0,0,0]
[2017,"PS1","SUBTERRANEO",0.01,0.02,1.4999999999999999E-2,7.0000000000000007E-2,0,0,0,0,0,0,0,0,0,0,0,0,0,0]
[2017,"PS1","SUPERFICIAL",0.01,0.02,1.4999999999999999E-2,7.0000000000000007E-2,0,0,0,0,0,0,0,0,0,0,0,0,0,0]
[2017,"PS2","SUBTERRANEO",0.01,0.02,1.4999999999999999E-2,7.0000000000000007E-2,0,0,0,0,0,0,0,0,0,0,0,0,0,0]
[2017,"PS2","SUPERFICIAL",0.01,0.02,1.4999999999999999E-2,7.0000000000000007E-2,0,0,0,0,0,0,0,0,0,0,0,0,0,0]
[2017,"SF2","SUBTERRANEO",0.01,0.02,2.1999999999999999E-2,7.0000000000000007E-2,0,0,0,0,0,0,0,0,0,0,0,0,0,0]
[2017,"SF2","SUPERFICIAL",0.01,0.02,2.1999999999999999E-2,7.0000000000000007E-2,0,0,0,0,0,0,0,0,0,0,0,0,0,0]
[2017,"SF5","SUBTERRANEO",0.01,0.02,0,7.0000000000000007E-2,0,0,0,0,0,0,0,0,0,0,0,0,0,0]
[2017,"SF5","SUPERFICIAL",0.01,0.02,0,7.0000000000000007E-2,0,0,0,0,0,0,0,0,0,0,0,0,0,0]
[2018,"DO1","SUBTERRANEO",3.5000000000000003E-2,0,0.04,0,0,0,0,0,0,0,0,0,0,0,0,0,0,0]
[2018,"DO1","SUPERFICIAL",0.03,0,0.04,0.16,0,0,0,0,0,0,0,0,0,0,0,0,0,0]
[2018,"DO2","SUBTERRANEO",3.3000000000000002E-2,0,0.04,0,0,0,0,0,0,0,0,0,0,0,0,0,0,0]
[2018,"DO2","SUPERFICIAL",0.03,0,0.04,0.16,0,0,0,0,0,0,0,0,0,0,0,0,0,0]
[2018,"DO3","SUBTERRANEO",3.3000000000000002E-2,0,0.04,0,0,0,0,0,0,0,0,0,0,0,0,0,0,0]
[2018,"DO3","SUPERFICIAL",0.03,0,0.04,0.16,0,0,0,0,0,0,0,0,0,0,0,0,0,0]
[2018,"DO4","SUBTERRANEO",3.5000000000000003E-2,0,0.04,0,0,0,0,0,0,0,0,0,0,0,0,0,0,0]
[2018,"DO4","SUPERFICIAL",0.03,0,0.04,0.16,0,0,0,0,0,0,0,0,0,0,0,0,0,0]
[2018,"DO5","SUBTERRANEO",3.3000000000000002E-2,0,0.04,0,0,0,0,0,0,0,0,0,0,0,0,0,0,0]
[2018,"DO5","SUPERFICIAL",0.03,0,0.04,0.16,0,0,0,0,0,0,0,0,0,0,0,0,0,0]
[2018,"DO6","SUBTERRANEO",3.3000000000000002E-2,0,0.04,0,0,0,0,0,0,0,0,0,0,0,0,0,0,0]
[2018,"DO6","SUPERFICIAL",0.03,0,0.04,0.16,0,0,0,0,0,0,0,0,0,0,0,0,0,0]
[2018,"PJ1","SUBTERRANEO",1.15E-2,0.02,0,0.1,0,0,0,0,0,0,0,0,0,0,0,0,0,0]
[2018,"PJ1","SUPERFICIAL",0.01,0.02,0,0.1,0,0,0,0,0,0,0,0,0,0,0,0,0,0]
[2018,"PN2","SUBTERRANEO",1.15E-2,0.02,0,0.1,0,0,0,0,0,0,0,0,0,0,0,0,0,0]
[2018,"PN2","SUPERFICIAL",0.01,0.02,0,0.1,0,0,0,0,0,0,0,0,0,0,0,0,0,0]
[2018,"PS1","SUBTERRANEO",0.01,0.02,1.4999999999999999E-2,7.0000000000000007E-2,0,0,0,0,0,0,0,0,0,0,0,0,0,0]
[2018,"PS1","SUPERFICIAL",0.01,0.02,1.4999999999999999E-2,7.0000000000000007E-2,0,0,0,0,0,0,0,0,0,0,0,0,0,0]
[2018,"PS2","SUBTERRANEO",0.01,0.02,1.4999999999999999E-2,7.0000000000000007E-2,0,0,0,0,0,0,0,0,0,0,0,0,0,0]
[2018,"PS2","SUPERFICIAL",0.01,0.02,1.4999999999999999E-2,7.0000000000000007E-2,0,0,0,0,0,0,0,0,0,0,0,0,0,0]
[2018,"SF2","SUBTERRANEO",1.2E-2,2.5000000000000001E-2,2.7E-2,8.5000000000000006E-2,0,0,0,0,0,0,0,0,0,0,0,0,0,0]
[2018,"SF2","SUPERFICIAL",1.2E-2,2.5000000000000001E-2,2.7E-2,8.5000000000000006E-2,0,0,0,0,0,0,0,0,0,0,0,0,0,0]
[2018,"SF5","SUBTERRANEO",0.01,0.02,0,7.0000000000000007E-2,0,0,0,0,0,0,0,0,0,0,0,0,0,0]
[2018,"SF5","SUPERFICIAL",0.01,0.02,0,7.0000000000000007E-2,0,0,0,0,0,0,0,0,0,0,0,0,0,0]
[2019,"DO1","SUBTERRANEO",3.5000000000000003E-2,0,0.04,0,0,0,0,0,0,0,0,0,0,0,0,0,0,0]
[2019,"DO1","SUPERFICIAL",0.03,0,0.04,0.16,0,0,0,0,0,0,0,0,0,0,0,0,0,0]
[2019,"DO2","SUBTERRANEO",3.3000000000000002E-2,0,0.04,0,0,0,0,0,0,0,0,0,0,0,0,0,0,0]
[2019,"DO2","SUPERFICIAL",0.03,0,0.04,0.16,0,0,0,0,0,0,0,0,0,0,0,0,0,0]
[2019,"DO3","SUBTERRANEO",3.3000000000000002E-2,0,0.04,0,0,0,0,0,0,0,0,0,0,0,0,0,0,0]
[2019,"DO3","SUPERFICIAL",0.03,0,0.04,0.16,0,0,0,0,0,0,0,0,0,0,0,0,0,0]
[2019,"DO4","SUBTERRANEO",3.5000000000000003E-2,0,0.04,0,0,0,0,0,0,0,0,0,0,0,0,0,0,0]
[2019,"DO4","SUPERFICIAL",0.03,0,0.04,0.16,0,0,0,0,0,0,0,0,0,0,0,0,0,0]
[2019,"DO5","SUBTERRANEO",3.3000000000000002E-2,0,0.04,0,0,0,0,0,0,0,0,0,0,0,0,0,0,0]
[2019,"DO5","SUPERFICIAL",0.03,0,0.04,0.16,0,0,0,0,0,0,0,0,0,0,0,0,0,0]
[2019,"DO6","SUBTERRANEO",3.3000000000000002E-2,0,0.04,0,0,0,0,0,0,0,0,0,0,0,0,0,0,0]
[2019,"DO6","SUPERFICIAL",0.03,0,0.04,0.16,0,0,0,0,0,0,0,0,0,0,0,0,0,0]
[2019,"PJ1","SUBTERRANEO",1.15E-2,0.02,0,0.1,0,0,0,0,0,0,0,0,0,0,0,0,0,0]
[2019,"PJ1","SUPERFICIAL",0.01,0.02,0,0.1,0,0,0,0,0,0,0,0,0,0,0,0,0,0]
[2019,"PN2","SUBTERRANEO",1.15E-2,0.02,0,0.1,0,0,0,0,0,0,0,0,0,0,0,0,0,0]
[2019,"PN2","SUPERFICIAL",0.01,0.02,0,0.1,0,0,0,0,0,0,0,0,0,0,0,0,0,0]
[2019,"PS1","SUBTERRANEO",0.01,0.02,1.4999999999999999E-2,7.0000000000000007E-2,0,0,0,0,0,0,0,0,0,0,0,0,0,0]
[2019,"PS1","SUPERFICIAL",0.01,0.02,1.4999999999999999E-2,7.0000000000000007E-2,0,0,0,0,0,0,0,0,0,0,0,0,0,0]
[2019,"PS2","SUBTERRANEO",0.01,0.02,1.4999999999999999E-2,7.0000000000000007E-2,0,0,0,0,0,0,0,0,0,0,0,0,0,0]
[2019,"PS2","SUPERFICIAL",0.01,0.02,1.4999999999999999E-2,7.0000000000000007E-2,0,0,0,0,0,0,0,0,0,0,0,0,0,0]
[2019,"SF2","SUBTERRANEO",1.4999999999999999E-2,0.03,3.1E-2,0.1,0,0,0,0,0,0,0,0,0,0,0,0,0,0]
[2019,"SF2","SUPERFICIAL",1.4999999999999999E-2,0.03,3.1E-2,0.1,0,0,0,0,0,0,0,0,0,0,0,0,0,0]
[2019,"SF5","SUBTERRANEO",0.01,0.02,0,7.0000000000000007E-2,0,0,0,0,0,0,0,0,0,0,0,0,0,0]
[2019,"SF5","SUPERFICIAL",0.01,0.02,0,7.0000000000000007E-2,0,0,0,0,0,0,0,0,0,0,0,0,0,0]
[2020,"DO1","SUBTERRANEO",3.5000000000000003E-2,0,0.04,0,0,0,0,0,0,0,0,0,0,0,0,0,0,0]
[2020,"DO1","SUPERFICIAL",0.03,0,0.04,0.16,0,0,0,0,0,0,0,0,0,0,0,0,0,0]
[2020,"DO2","SUBTERRANEO",3.3000000000000002E-2,0,0.04,0,0,0,0,0,0,0,0,0,0,0,0,0,0,0]
[2020,"DO2","SUPERFICIAL",0.03,0,0.04,0.16,0,0,0,0,0,0,0,0,0,0,0,0,0,0]
[2020,"DO3","SUBTERRANEO",3.3000000000000002E-2,0,0.04,0,0,0,0,0,0,0,0,0,0,0,0,0,0,0]
[2020,"DO3","SUPERFICIAL",0.03,0,0.04,0.16,0,0,0,0,0,0,0,0,0,0,0,0,0,0]
[2020,"DO4","SUBTERRANEO",3.5000000000000003E-2,0,0.04,0,0,0,0,0,0,0,0,0,0,0,0,0,0,0]
[2020,"DO4","SUPERFICIAL",0.03,0,0.04,0.16,0,0,0,0,0,0,0,0,0,0,0,0,0,0]
[2020,"DO5","SUBTERRANEO",3.3000000000000002E-2,0,0.04,0,0,0,0,0,0,0,0,0,0,0,0,0,0,0]
[2020,"DO5","SUPERFICIAL",0.03,0,0.04,0.16,0,0,0,0,0,0,0,0,0,0,0,0,0,0]
[2020,"DO6","SUBTERRANEO",3.3000000000000002E-2,0,0.04,0,0,0,0,0,0,0,0,0,0,0,0,0,0,0]
[2020,"DO6","SUPERFICIAL",0.03,0,0.04,0.16,0,0,0,0,0,0,0,0,0,0,0,0,0,0]
[2020,"PJ1","SUBTERRANEO",1.15E-2,0.02,0,0.1,0,0,0,0,0,0,0,0,0,0,0,0,0,0]
[2020,"PJ1","SUPERFICIAL",0.01,0.02,0,0.1,0,0,0,0,0,0,0,0,0,0,0,0,0,0]
[2020,"PN2","SUBTERRANEO",1.15E-2,0.02,0,0.1,0,0,0,0,0,0,0,0,0,0,0,0,0,0]
[2020,"PN2","SUPERFICIAL",0.01,0.02,0,0.1,0,0,0,0,0,0,0,0,0,0,0,0,0,0]
[2020,"PS1","SUBTERRANEO",0.01,0.02,1.4999999999999999E-2,7.0000000000000007E-2,0,0,0,0,0,0,0,0,0,0,0,0,0,0]
[2020,"PS1","SUPERFICIAL",0.01,0.02,1.4999999999999999E-2,7.0000000000000007E-2,0,0,0,0,0,0,0,0,0,0,0,0,0,0]
[2020,"PS2","SUBTERRANEO",0.01,0.02,1.4999999999999999E-2,7.0000000000000007E-2,0,0,0,0,0,0,0,0,0,0,0,0,0,0]
[2020,"PS2","SUPERFICIAL",0.01,0.02,1.4999999999999999E-2,7.0000000000000007E-2,0,0,0,0,0,0,0,0,0,0,0,0,0,0]
[2020,"SF2","SUBTERRANEO",1.7999999999999999E-2,3.4000000000000002E-2,0.04,0.11899999999999999,0,0,0,0,0,0,0,0,0,0,0,0,0,0]
[2020,"SF2","SUPERFICIAL",1.7999999999999999E-2,3.4000000000000002E-2,0.04,0.11899999999999999,0,0,0,0,0,0,0,0,0,0,0,0,0,0]
[2020,"SF5","SUBTERRANEO",0.01,0.02,0,7.0000000000000007E-2,0,0,0,0,0,0,0,0,0,0,0,0,0,0]
[2020,"SF5","SUPERFICIAL",0.01,0.02,0,7.0000000000000007E-2,0,0,0,0,0,0,0,0,0,0,0,0,0,0]
[2021,"DO1","SUBTERRANEO",3.6600000000000001E-2,0,0.04,0,0,0,0,0,0,0,0,0,0,0,0,0,0,0]
[2021,"DO1","SUPERFICIAL",3.1399999999999997E-2,0,0.04,0.16719999999999999,0,0,0,0,0,0,0,0,0,0,0,0,0,0]
[2021,"DO2","SUBTERRANEO",3.4500000000000003E-2,0,0.04,0,0,0,0,0,0,0,0,0,0,0,0,0,0,0]
[2021,"DO2","SUPERFICIAL",3.1399999999999997E-2,0,0.04,0.16719999999999999,0,0,0,0,0,0,0,0,0,0,0,0,0,0]
[2021,"DO3","SUBTERRANEO",3.4500000000000003E-2,0,0.04,0,0,0,0,0,0,0,0,0,0,0,0,0,0,0]
[2021,"DO3","SUPERFICIAL",3.1399999999999997E-2,0,0.04,0.16719999999999999,0,0,0,0,0,0,0,0,0,0,0,0,0,0]
[2021,"DO4","SUBTERRANEO",3.6600000000000001E-2,0,0.04,0,0,0,0,0,0,0,0,0,0,0,0,0,0,0]
[2021,"DO4","SUPERFICIAL",3.1399999999999997E-2,0,0.04,0.16719999999999999,0,0,0,0,0,0,0,0,0,0,0,0,0,0]
[2021,"DO5","SUBTERRANEO",3.4500000000000003E-2,0,0.04,0,0,0,0,0,0,0,0,0,0,0,0,0,0,0]
[2021,"DO5","SUPERFICIAL",3.1399999999999997E-2,0,0.04,0.16719999999999999,0,0,0,0,0,0,0,0,0,0,0,0,0,0]
[2021,"DO6","SUBTERRANEO",3.4500000000000003E-2,0,0.04,0,0,0,0,0,0,0,0,0,0,0,0,0,0,0]
[2021,"DO6","SUPERFICIAL",3.1399999999999997E-2,0,0.04,0.16719999999999999,0,0,0,0,0,0,0,0,0,0,0,0,0,0]
[2021,"PJ1","SUBTERRANEO",1.2500000000000001E-2,2.0899999999999998E-2,0,0,0,0,0,0,0,0,0,0,0,0,0,0,0,0]
[2021,"PJ1","SUPERFICIAL",0.01,2.0899999999999998E-2,0,0.1045,0,0,0,0,0,0,0,0,0,0,0,0,0,0]
[2021,"PN2","SUBTERRANEO",1.2500000000000001E-2,2.0899999999999998E-2,0,0,0,0,0,0,0,0,0,0,0,0,0,0,0,0]
[2021,"PN2","SUPERFICIAL",1.0500000000000001E-2,2.0899999999999998E-2,0,0.1045,0,0,0,0,0,0,0,0,0,0,0,0,0,0]
[2021,"PS1","SUBTERRANEO",1.0500000000000001E-2,2.0899999999999998E-2,1.5800000000000002E-2,0,0,0,0,0,0,0,0,0,0,0,0,0,0,0]
[2021,"PS1","SUPERFICIAL",1.0500000000000001E-2,2.0899999999999998E-2,1.5800000000000002E-2,7.3200000000000001E-2,0,0,0,0,0,0,0,0,0,0,0,0,0,0]
[2021,"PS2","SUBTERRANEO",1.0500000000000001E-2,2.0899999999999998E-2,1.5800000000000002E-2,0,0,0,0,0,0,0,0,0,0,0,0,0,0,0]
[2021,"PS2","SUPERFICIAL",1.0500000000000001E-2,2.0899999999999998E-2,1.5800000000000002E-2,7.3200000000000001E-2,0,0,0,0,0,0,0,0,0,0,0,0,0,0]
[2021,"SF2","SUBTERRANEO",1.8800000000000001E-2,3.5499999999999997E-2,4.1799999999999997E-2,0,0,0,0,0,0,0,0,0,0,0,0,0,0,0]
[2021,"SF2","SUPERFICIAL",1.8800000000000001E-2,3.5499999999999997E-2,4.1799999999999997E-2,0.1244,0,0,0,0,0,0,0,0,0,0,0,0,0,0]
[2021,"SF5","SUBTERRANEO",1.4149999999999999E-2,2.8299999999999999E-2,0,9.9099999999999994E-2,0,0,0,0,0,0,0,0,0,0,0,0,0,0]
[2021,"SF5","SUPERFICIAL",1.4149999999999999E-2,2.8299999999999999E-2,0,9.9099999999999994E-2,0,0,0,0,0,0,0,0,0,0,0,0,0,0]
[2022,"DO1","SUBTERRANEO",4.0300000000000002E-2,0,4.5999999999999999E-2,0,0,0,"-   ","-   ",0,0,0,"-   ",0,0,0,0,0,0]
[2022,"DO1","SUPERFICIAL",3.4599999999999999E-2,0,4.5999999999999999E-2,0.184,0,0,"-   ","-   ",0,0,0,"-   ",0,0,0,0,0,0]
[2022,"DO2","SUBTERRANEO",3.7999999999999999E-2,0,4.5999999999999999E-2,0,0,0,"-   ","-   ",0,0,0,"-   ",0,0,0,0,0,0]
[2022,"DO2","SUPERFICIAL",3.4599999999999999E-2,0,4.5999999999999999E-2,0.184,0,0,"-   ","-   ",0,0,0,"-   ",0,0,0,0,0,0]
[2022,"DO3","SUBTERRANEO",3.7999999999999999E-2,0,4.5999999999999999E-2,0,0,0,"-   ","-   ",0,0,0,"-   ",0,0,0,0,0,0]
[2022,"DO3","SUPERFICIAL",3.4599999999999999E-2,0,4.5999999999999999E-2,0.184,0,0,"-   ","-   ",0,0,0,"-   ",0,0,0,0,0,0]
[2022,"DO4","SUBTERRANEO",4.0300000000000002E-2,0,4.5999999999999999E-2,0,0,0,"-   ","-   ",0,0,0,"-   ",0,0,0,0,0,0]
[2022,"DO4","SUPERFICIAL",3.4599999999999999E-2,0,4.5999999999999999E-2,0.184,0,0,"-   ","-   ",0,0,0,"-   ",0,0,0,0,0,0]
[2022,"DO5","SUBTERRANEO",3.7999999999999999E-2,0,4.5999999999999999E-2,0,0,0,"-   ","-   ",0,0,0,"-   ",0,0,0,0,0,0]
[2022,"DO5","SUPERFICIAL",3.4599999999999999E-2,0,4.5999999999999999E-2,0.184,0,0,"-   ","-   ",0,0,0,"-   ",0,0,0,0,0,0]
[2022,"DO6","SUBTERRANEO",3.7999999999999999E-2,0,4.5999999999999999E-2,0,0,0,"-   ","-   ",0,0,0,"-   ",0,0,0,0,0,0]
[2022,"DO6","SUPERFICIAL",3.4599999999999999E-2,0,4.5999999999999999E-2,0.184,0,0,"-   ","-   ",0,0,0,"-   ",0,0,0,0,0,0]
[2022,"PJ1","SUBTERRANEO",1.38E-2,2.3E-2,0,0,0,0,"-   ","-   ",0,0,0,"-   ",0,0,0,0,0,0]
[2022,"PJ1","SUPERFICIAL",1.1599999999999999E-2,2.3E-2,0,0.115,0,0,"-   ","-   ",0,0,0,"-   ",0,0,0,0,0,0]
[2022,"PS1","SUBTERRANEO",1.1599999999999999E-2,2.3E-2,0,0,0,0,"-   ","-   ",0,0,0,"-   ",0,0,0,0,0,0]
[2022,"PS1","SUPERFICIAL",1.1599999999999999E-2,2.3E-2,0,8.0600000000000005E-2,0,0,"-   ","-   ",0,0,0,"-   ",0,0,0,0,0,0]
[2022,"PS2","SUBTERRANEO",1.1599999999999999E-2,2.3E-2,0,0,0,0,"-   ","-   ",0,0,0,"-   ",0,0,0,0,0,0]
[2022,"PS2","SUPERFICIAL",1.1599999999999999E-2,2.3E-2,0,8.0600000000000005E-2,0,0,"-   ","-   ",0,0,0,"-   ",0,0,0,0,0,0]
[2022,"PN2","SUBTERRANEO",1.38E-2,2.3E-2,0,0,0,0,"-   ","-   ",0,0,0,"-   ",0,0,0,0,0,0]
[2022,"PN2","SUPERFICIAL",1.1599999999999999E-2,2.3E-2,0,0.115,0,0,"-   ","-   ",0,0,0,"-   ",0,0,0,0,0,0]
[2022,"SF2","SUBTERRANEO",2.07E-2,3.9100000000000003E-2,4.2000000000000003E-2,0,0,0,"-   ","-   ",0,0,0,"-   ",0,0,0,0,0,0]
[2022,"SF2","SUPERFICIAL",2.07E-2,3.9100000000000003E-2,4.2000000000000003E-2,0.13689999999999999,0,0,"-   ","-   ",0,0,0,"-   ",0,0,0,0,0,0]
[2022,"SF5","SUBTERRANEO",2.01E-2,4.0300000000000002E-2,0,0,0,0,"-   ","-   ",0,0,0,"-   ",0,0,0,0,0,0]
[2022,"SF5","SUPERFICIAL",2.01E-2,4.0300000000000002E-2,0,0.14099999999999999,0,0,"-   ","-   ",0,0,0,"-   ",0,0,0,0,0,0]
[2022,"GD2","A","-   ",0,0,0,3.2000000000000001E-2,3.2000000000000001E-2,4.1999999999999997E-3,4.1999999999999997E-3,4.1999999999999997E-3,0,4.2000000000000003E-2,4.2000000000000003E-2,0,0.21,0.21,0,0.21,0.21]
[2022,"GD2","B","-   ",0,0,0,3.2000000000000001E-2,3.2000000000000001E-2,3.8E-3,3.8E-3,3.8E-3,0,3.7999999999999999E-2,3.7999999999999999E-2,0,0.19,0.19,0,0.19,0.19]
[2022,"GD2","C","-   ",0,0,0,3.2000000000000001E-2,3.2000000000000001E-2,3.5000000000000001E-3,3.5000000000000001E-3,3.5000000000000001E-3,3.5000000000000003E-2,3.5000000000000003E-2,3.5000000000000003E-2,0,0.17499999999999999,0.17499999999999999,0,0.17499999999999999,0.17499999999999999]
[2022,"GD2","D","-   ",0,0,0,3.2000000000000001E-2,3.2000000000000001E-2,3.2000000000000002E-3,3.2000000000000002E-3,3.2000000000000002E-3,0,3.2000000000000001E-2,3.2000000000000001E-2,0,0.16,0.16,0,0.16,0.16]
[2022,"GD3","A","-   ",0,0,0,3.2000000000000001E-2,3.2000000000000001E-2,4.1999999999999997E-3,4.1999999999999997E-3,4.1999999999999997E-3,0,4.2000000000000003E-2,4.2000000000000003E-2,0,0.21,0.21,0,0.21,0.21]
[2022,"GD3","B","-   ",0,0,0,3.2000000000000001E-2,3.2000000000000001E-2,3.5000000000000001E-3,3.5000000000000001E-3,3.5000000000000001E-3,3.5000000000000003E-2,3.5000000000000003E-2,3.5000000000000003E-2,0,0.19,0.19,0,0.17499999999999999,0.17499999999999999]
[2022,"GD3","C","-   ",0,0,0,3.2000000000000001E-2,3.2000000000000001E-2,3.2000000000000002E-3,3.2000000000000002E-3,3.2000000000000002E-3,0,3.2000000000000001E-2,3.2000000000000001E-2,0,0.16,0.16,0,0.16,0.16]
[2022,"PN1","A","-   ",0,0,0,3.4500000000000003E-2,3.4500000000000003E-2,5.7999999999999996E-3,5.7999999999999996E-3,5.7999999999999996E-3,"-   ",4.5900000000000003E-2,4.5900000000000003E-2,0,0.23880000000000001,0.23880000000000001,0.23880000000000001,0.23880000000000001,0.23880000000000001]
[2022,"PN1","B","-   ",0,0,0,3.4500000000000003E-2,3.4500000000000003E-2,5.4000000000000003E-3,5.4000000000000003E-3,5.4000000000000003E-3,"-   ",4.1700000000000001E-2,4.1700000000000001E-2,0,0.22040000000000001,0.22040000000000001,0.22040000000000001,0.22040000000000001,0.22040000000000001]
[2022,"PN1","C","-   ",0,0,0,3.4500000000000003E-2,3.4500000000000003E-2,4.8999999999999998E-3,4.8999999999999998E-3,4.8999999999999998E-3,3.5000000000000003E-2,3.7900000000000003E-2,3.7900000000000003E-2,0,0.20200000000000001,0.20200000000000001,0.20200000000000001,0.20200000000000001,0.20200000000000001]
[2022,"PN1","D","-   ",0,0,0,3.4500000000000003E-2,3.4500000000000003E-2,4.4999999999999997E-3,4.4999999999999997E-3,4.4999999999999997E-3,"-   ",3.4500000000000003E-2,3.4500000000000003E-2,0,0.1837,0.1837,0.1837,0.1837,0.1837]
[2022,"PN3","A","-   ",0,0,0,4.5900000000000003E-2,5.0500000000000003E-2,6.0000000000000001E-3,6.0000000000000001E-3,6.6E-3,4.5900000000000003E-2,4.5900000000000003E-2,4.5900000000000003E-2,0,0.2445,0.26900000000000002,0,0.2445,0.2445]
[2022,"PN3","B","-   ",0,0,0,4.1700000000000001E-2,4.5900000000000003E-2,5.4000000000000003E-3,5.4000000000000003E-3,6.0000000000000001E-3,4.1700000000000001E-2,4.1700000000000001E-2,4.1700000000000001E-2,1,0.2369,0.2606,0,0.2223,0.2223]
[2022,"PN3","B",0,0,0,0,"-   ",0,0,0,0,0,0,0,2,0.2296,0.25259999999999999,0,0,0]
[2022,"PN3","B",0,0,0,0,"-   ",0,0,0,0,0,0,0,3,0.2223,0.2445,0,0,0]
[2022,"PN3","C","-   ",0,0,0,3.7999999999999999E-2,4.1700000000000001E-2,5.0000000000000001E-3,5.0000000000000001E-3,5.4000000000000003E-3,3.7999999999999999E-2,3.7999999999999999E-2,3.7999999999999999E-2,0,0.2021,0.2223,0,0.2021,0.2021]
[2022,"PN3","D","-   ",0,0,0,3.4500000000000003E-2,3.7999999999999999E-2,4.4999999999999997E-3,4.4999999999999997E-3,5.0000000000000001E-3,3.4500000000000003E-2,3.4500000000000003E-2,3.4500000000000003E-2,1,0.1958,0.21540000000000001,0,0.1837,0.1837]
[2022,"PN3","D",0,0,0,0,0,0,0,0,0,0,0,0,2,0.1898,0.2087,0,0,0]
[2022,"PN3","D",0,0,0,0,0,0,0,0,0,0,0,0,3,0.1837,0.2021,0,0,0]
[2022,"SF3","A","-   ",0,0,0,3.2000000000000001E-2,3.2000000000000001E-2,4.1999999999999997E-3,4.1999999999999997E-3,4.1999999999999997E-3,0,4.2000000000000003E-2,4.2000000000000003E-2,0,0.21,0,0,0.21,0.21]
[2022,"SF3","B","-   ",0,0,0,3.2000000000000001E-2,3.2000000000000001E-2,3.8E-3,3.8E-3,3.8E-3,0,3.7999999999999999E-2,3.7999999999999999E-2,0,0.19,0,0,0.19,0.19]
[2022,"SF3","C","-   ",0,0,0,3.2000000000000001E-2,3.2000000000000001E-2,3.5000000000000001E-3,3.5000000000000001E-3,3.5000000000000001E-3,3.5000000000000003E-2,3.5000000000000003E-2,3.5000000000000003E-2,0,0.17499999999999999,0,0,0.17499999999999999,0.17499999999999999]
[2022,"SF3","D","-   ",0,0,0,3.2000000000000001E-2,3.2000000000000001E-2,3.2000000000000002E-3,3.2000000000000002E-3,3.2000000000000002E-3,0,3.2000000000000001E-2,3.2000000000000001E-2,0,0.16,0,0,0.16,0.16]
[2022,"CERH","A",0,0,0,0,3.2000000000000001E-2,3.2000000000000001E-2,4.1999999999999997E-3,4.1999999999999997E-3,4.1999999999999997E-3,0,4.2000000000000003E-2,4.2000000000000003E-2,0,0.21,0.21,0,0.21,0.21]
[2022,"CERH","B",0,0,0,0,3.2000000000000001E-2,3.2000000000000001E-2,3.8E-3,3.8E-3,3.8E-3,0,3.7999999999999999E-2,3.7999999999999999E-2,0,0.19,0.19,0,0.19,0.19]
[2022,"CERH","C",0,0,0,0,3.2000000000000001E-2,3.2000000000000001E-2,3.5000000000000001E-3,3.5000000000000001E-3,3.5000000000000001E-3,3.5000000000000003E-2,3.5000000000000003E-2,3.5000000000000003E-2,0,0.17499999999999999,0.17499999999999999,0,0.17499999999999999,0.17499999999999999]
[2022,"CERH","D",0,0,0,0,3.2000000000000001E-2,3.2000000000000001E-2,3.2000000000000002E-3,3.2000000000000002E-3,3.2000000000000002E-3,0,3.2000000000000001E-2,3.2000000000000001E-2,0,0.16,0.16,0,0.16,0.16]
[2023,"DO1","SUBTERRANEO",4.2599999999999999E-2,0,4.87E-2,0,0,0,0,0,0,0,0,0,0,0,0,0,0,0]
[2023,"DO1","SUPERFICIAL",3.6600000000000001E-2,0,4.87E-2,0.19470000000000001,0,0,0,0,0,0,0,0,0,0,0,0,0,0]
[2023,"DO2","SUBTERRANEO",4.02E-2,0,4.87E-2,0,0,0,0,0,0,0,0,0,0,0,0,0,0,0]
[2023,"DO2","SUPERFICIAL",3.6600000000000001E-2,0,4.87E-2,0.19470000000000001,0,0,0,0,0,0,0,0,0,0,0,0,0,0]
[2023,"DO3","SUBTERRANEO",4.02E-2,0,4.87E-2,0,0,0,0,0,0,0,0,0,0,0,0,0,0,0]
[2023,"DO3","SUPERFICIAL",3.6600000000000001E-2,0,4.87E-2,0.19470000000000001,0,0,0,0,0,0,0,0,0,0,0,0,0,0]
[2023,"DO4","SUBTERRANEO",4.2599999999999999E-2,0,4.87E-2,0,0,0,0,0,0,0,0,0,0,0,0,0,0,0]
[2023,"DO4","SUPERFICIAL",3.6600000000000001E-2,0,4.87E-2,0.19470000000000001,0,0,0,0,0,0,0,0,0,0,0,0,0,0]
[2023,"DO5","SUBTERRANEO",4.02E-2,0,4.87E-2,0,0,0,0,0,0,0,0,0,0,0,0,0,0,0]
[2023,"DO5","SUPERFICIAL",3.6600000000000001E-2,0,4.87E-2,0.19470000000000001,0,0,0,0,0,0,0,0,0,0,0,0,0,0]
[2023,"DO6","SUBTERRANEO",4.02E-2,0,4.87E-2,0,0,0,0,0,0,0,0,0,0,0,0,0,0,0]
[2023,"DO6","SUPERFICIAL",3.6600000000000001E-2,0,4.87E-2,0.19470000000000001,0,0,0,0,0,0,0,0,0,0,0,0,0,0]
[2023,"PJ1","SUBTERRANEO",1.46E-2,2.4299999999999999E-2,0,0,0,0,0,0,0,0,0,0,0,0,0,0,0,0]
[2023,"PJ1","SUPERFICIAL",1.23E-2,2.4299999999999999E-2,0,0.1217,0,0,0,0,0,0,0,0,0,0,0,0,0,0]
[2023,"PS1","SUBTERRANEO",1.23E-2,2.4299999999999999E-2,0,0,0,0,0,0,0,0,0,0,0,0,0,0,0,0]
[2023,"PS1","SUPERFICIAL",1.23E-2,2.4299999999999999E-2,0,8.5300000000000001E-2,0,0,0,0,0,0,0,0,0,0,0,0,0,0]
[2023,"PS2","SUBTERRANEO",1.23E-2,2.4299999999999999E-2,0,0,0,0,0,0,0,0,0,0,0,0,0,0,0,0]
[2023,"PS2","SUPERFICIAL",1.23E-2,2.4299999999999999E-2,0,8.5300000000000001E-2,0,0,0,0,0,0,0,0,0,0,0,0,0,0]
[2023,"SF2","SUBTERRANEO",2.1899999999999999E-2,4.1399999999999999E-2,4.87E-2,0,0,0,0,0,0,0,0,0,0,0,0,0,0,0]
[2023,"SF2","SUPERFICIAL",2.1899999999999999E-2,4.1399999999999999E-2,4.87E-2,0.14480000000000001,0,0,0,0,0,0,0,0,0,0,0,0,0,0]
[2023,"SF5","SUBTERRANEO",2.1299999999999999E-2,4.2599999999999999E-2,0,0,0,0,0,0,0,0,0,0,0,0,0,0,0,0]
[2023,"SF5","SUPERFICIAL",2.1299999999999999E-2,4.2599999999999999E-2,0,0.1492,0,0,0,0,0,0,0,0,0,0,0,0,0,0]
[2023,"GD1","A",0,0,0,0,3.39E-2,3.39E-2,5.4000000000000003E-3,5.4000000000000003E-3,5.4000000000000003E-3,0,8.1199999999999994E-2,5.4199999999999998E-2,0,0.27079999999999999,0.27079999999999999,0,0.27079999999999999,0.27079999999999999]
[2023,"GD1","B",0,0,0,0,3.39E-2,3.39E-2,4.4000000000000003E-3,4.4000000000000003E-3,4.4000000000000003E-3,0.13200000000000001,6.6000000000000003E-2,4.3999999999999997E-2,0,0.22,0.22,0,0.20100000000000001,0.22]
[2023,"GD1","C",0,0,0,0,3.39E-2,3.39E-2,3.3999999999999998E-3,3.3999999999999998E-3,3.3999999999999998E-3,0,5.0799999999999998E-2,3.39E-2,0,0.16930000000000001,0.16930000000000001,0,0.18509999999999999,0.16930000000000001]
[2023,"GD2","A",0,0,0,0,3.39E-2,3.39E-2,4.4000000000000003E-3,4.4000000000000003E-3,4.4000000000000003E-3,0,4.4400000000000002E-2,4.4400000000000002E-2,0,0.22220000000000001,0.22220000000000001,0,0.22220000000000001,0.22220000000000001]
[2023,"GD2","B",0,0,0,0,3.39E-2,3.39E-2,4.0000000000000001E-3,4.0000000000000001E-3,4.0000000000000001E-3,0,4.02E-2,4.02E-2,0,0.20100000000000001,0.20100000000000001,0,0.20100000000000001,0.20100000000000001]
[2023,"GD2","C",0,0,0,0,3.39E-2,3.39E-2,3.7000000000000002E-3,3.7000000000000002E-3,3.7000000000000002E-3,3.6999999999999998E-2,3.6999999999999998E-2,3.6999999999999998E-2,0,0.18509999999999999,0.18509999999999999,0,0.18509999999999999,0.18509999999999999]
[2023,"GD2","D",0,0,0,0,3.39E-2,3.39E-2,3.3999999999999998E-3,3.3999999999999998E-3,3.3999999999999998E-3,0,3.39E-2,3.39E-2,0,0.16930000000000001,0.16930000000000001,0,0.16930000000000001,0.16930000000000001]
[2023,"GD3","A",0,0,0,0,3.39E-2,3.39E-2,4.4000000000000003E-3,4.4000000000000003E-3,4.4000000000000003E-3,0,4.4400000000000002E-2,4.4400000000000002E-2,0,0.22220000000000001,0.22220000000000001,0,0.22220000000000001,0.22220000000000001]
[2023,"GD3","B",0,0,0,0,3.39E-2,3.39E-2,3.7000000000000002E-3,3.7000000000000002E-3,3.7000000000000002E-3,3.6999999999999998E-2,3.6999999999999998E-2,3.6999999999999998E-2,0,0.20100000000000001,0.20100000000000001,0,0.20100000000000001,0.20100000000000001]
[2023,"GD3","C",0,0,0,0,3.39E-2,3.39E-2,3.3999999999999998E-3,3.3999999999999998E-3,3.3999999999999998E-3,0,3.39E-2,3.39E-2,0,0.16930000000000001,0.16930000000000001,0,0.16930000000000001,0.16930000000000001]
[2023,"GD4","A",0,0,0,0,3.39E-2,3.39E-2,4.4000000000000003E-3,4.4000000000000003E-3,4.4000000000000003E-3,0,4.4400000000000002E-2,4.4400000000000002E-2,0,0.22220000000000001,0.22220000000000001,0,0.22220000000000001,0.22220000000000001]
[2023,"GD4","B",0,0,0,0,3.39E-2,3.39E-2,4.0000000000000001E-3,4.0000000000000001E-3,4.0000000000000001E-3,0,4.02E-2,4.02E-2,0,0.20100000000000001,0.20100000000000001,0,0.20100000000000001,0.20100000000000001]
[2023,"GD4","C",0,0,0,0,3.39E-2,3.39E-2,3.7000000000000002E-3,3.7000000000000002E-3,3.7000000000000002E-3,3.6999999999999998E-2,3.6999999999999998E-2,3.6999999999999998E-2,0,0.18509999999999999,0.18509999999999999,0,0.18509999999999999,0.18509999999999999]
[2023,"GD4","D",0,0,0,0,3.39E-2,3.39E-2,3.3999999999999998E-3,3.3999999999999998E-3,3.3999999999999998E-3,0,3.39E-2,3.39E-2,0,0.16930000000000001,0.16930000000000001,0,0.16930000000000001,0.16930000000000001]
[2023,"GD5","A",0,0,0,0,3.39E-2,3.39E-2,4.4000000000000003E-3,4.4000000000000003E-3,4.4000000000000003E-3,0,4.4400000000000002E-2,4.4400000000000002E-2,0,0.22220000000000001,0.22220000000000001,0,0.22220000000000001,0.22220000000000001]
[2023,"GD5","B",0,0,0,0,3.39E-2,3.39E-2,4.0000000000000001E-3,4.0000000000000001E-3,4.0000000000000001E-3,0,4.02E-2,4.02E-2,0,0.20100000000000001,0.20100000000000001,0,0.20100000000000001,0.20100000000000001]
[2023,"GD5","C",0,0,0,0,3.39E-2,3.39E-2,3.7000000000000002E-3,3.7000000000000002E-3,3.7000000000000002E-3,3.6999999999999998E-2,3.6999999999999998E-2,3.6999999999999998E-2,0,0.18509999999999999,0.18509999999999999,0,0.18509999999999999,0.18509999999999999]
[2023,"GD5","D",0,0,0,0,3.39E-2,3.39E-2,3.3999999999999998E-3,3.3999999999999998E-3,3.3999999999999998E-3,0,3.39E-2,3.39E-2,0,0.16930000000000001,0.16930000000000001,0,0.16930000000000001,0.16930000000000001]
[2023,"GD6","A",0,0,0,0,3.39E-2,3.39E-2,4.4000000000000003E-3,4.4000000000000003E-3,4.4000000000000003E-3,0,4.4400000000000002E-2,4.4400000000000002E-2,0,0.22220000000000001,0.22220000000000001,0,0.22220000000000001,0.22220000000000001]
[2023,"GD6","B",0,0,0,0,3.39E-2,3.39E-2,4.0000000000000001E-3,4.0000000000000001E-3,4.0000000000000001E-3,0,4.02E-2,4.02E-2,0,0.20100000000000001,0.20100000000000001,0,0.20100000000000001,0.20100000000000001]
[2023,"GD6","C",0,0,0,0,3.39E-2,3.39E-2,3.7000000000000002E-3,3.7000000000000002E-3,3.7000000000000002E-3,3.6999999999999998E-2,3.6999999999999998E-2,3.6999999999999998E-2,0,0.18509999999999999,0.18509999999999999,0,0.18509999999999999,0.18509999999999999]
[2023,"GD6","D",0,0,0,0,3.39E-2,3.39E-2,3.3999999999999998E-3,3.3999999999999998E-3,3.3999999999999998E-3,0,3.39E-2,3.39E-2,0,0.16930000000000001,0.16930000000000001,0,0.16930000000000001,0.16930000000000001]
[2023,"GD7","A",0,0,0,0,3.39E-2,3.39E-2,4.4000000000000003E-3,4.4000000000000003E-3,4.4000000000000003E-3,0,4.4400000000000002E-2,4.4400000000000002E-2,0,0.22220000000000001,0.22220000000000001,0,0.22220000000000001,0.22220000000000001]
[2023,"GD7","B",0,0,0,0,3.39E-2,3.39E-2,4.0000000000000001E-3,4.0000000000000001E-3,4.0000000000000001E-3,0,4.02E-2,4.02E-2,0,0.20100000000000001,0.20100000000000001,0,0.20100000000000001,0.20100000000000001]
[2023,"GD7","C",0,0,0,0,3.39E-2,3.39E-2,3.7000000000000002E-3,3.7000000000000002E-3,3.7000000000000002E-3,3.6999999999999998E-2,3.6999999999999998E-2,3.6999999999999998E-2,0,0.18509999999999999,0.18509999999999999,0,0.18509999999999999,0.18509999999999999]
[2023,"GD7","D",0,0,0,0,3.39E-2,3.39E-2,3.3999999999999998E-3,3.3999999999999998E-3,3.3999999999999998E-3,0,3.39E-2,3.39E-2,0,0.16930000000000001,0.16930000000000001,0,0.16930000000000001,0.16930000000000001]
[2023,"GD8","A",0,0,0,0,3.39E-2,3.39E-2,4.4000000000000003E-3,4.4000000000000003E-3,4.4000000000000003E-3,0,4.4400000000000002E-2,4.4400000000000002E-2,0,0.22220000000000001,0.22220000000000001,0,0.22220000000000001,0.22220000000000001]
[2023,"GD8","B",0,0,0,0,3.39E-2,3.39E-2,4.0000000000000001E-3,4.0000000000000001E-3,4.0000000000000001E-3,0,4.02E-2,4.02E-2,0,0.20100000000000001,0.20100000000000001,0,0.20100000000000001,0.20100000000000001]
[2023,"GD8","C",0,0,0,0,3.39E-2,3.39E-2,3.7000000000000002E-3,3.7000000000000002E-3,3.7000000000000002E-3,3.6999999999999998E-2,3.6999999999999998E-2,3.6999999999999998E-2,0,0.18509999999999999,0.18509999999999999,0,0.18509999999999999,0.18509999999999999]
[2023,"GD8","D",0,0,0,0,3.39E-2,3.39E-2,3.3999999999999998E-3,3.3999999999999998E-3,3.3999999999999998E-3,0,3.39E-2,3.39E-2,0,0.16930000000000001,0.16930000000000001,0,0.16930000000000001,0.16930000000000001]
[2023,"JQ1","A",0,0,0,0,3.39E-2,3.39E-2,4.4000000000000003E-3,4.4000000000000003E-3,4.4000000000000003E-3,0,4.4400000000000002E-2,4.4400000000000002E-2,0,0.22220000000000001,0.22220000000000001,0,0.22220000000000001,0.22220000000000001]
[2023,"JQ1","B",0,0,0,0,3.39E-2,3.39E-2,4.0000000000000001E-3,4.0000000000000001E-3,4.0000000000000001E-3,0,4.02E-2,4.02E-2,0,0.20100000000000001,0.20100000000000001,0,0.20100000000000001,0.20100000000000001]
[2023,"JQ1","C",0,0,0,0,3.39E-2,3.39E-2,3.7000000000000002E-3,3.7000000000000002E-3,3.7000000000000002E-3,3.6999999999999998E-2,3.6999999999999998E-2,3.6999999999999998E-2,0,0.18509999999999999,0.18509999999999999,0,0.18509999999999999,0.18509999999999999]
[2023,"JQ1","D",0,0,0,0,3.39E-2,3.39E-2,3.3999999999999998E-3,3.3999999999999998E-3,3.3999999999999998E-3,0,3.39E-2,3.39E-2,0,0.16930000000000001,0.16930000000000001,0,0.16930000000000001,0.16930000000000001]
[2023,"JQ2","A",0,0,0,0,3.39E-2,3.39E-2,4.4000000000000003E-3,4.4000000000000003E-3,4.4000000000000003E-3,0,4.4400000000000002E-2,4.4400000000000002E-2,0,0.22220000000000001,0.22220000000000001,0,0.22220000000000001,0.22220000000000001]
[2023,"JQ2","B",0,0,0,0,3.39E-2,3.39E-2,4.0000000000000001E-3,4.0000000000000001E-3,4.0000000000000001E-3,0,4.02E-2,4.02E-2,0,0.20100000000000001,0.20100000000000001,0,0.20100000000000001,0.20100000000000001]
[2023,"JQ2","C",0,0,0,0,3.39E-2,3.39E-2,3.7000000000000002E-3,3.7000000000000002E-3,3.7000000000000002E-3,3.6999999999999998E-2,3.6999999999999998E-2,3.6999999999999998E-2,0,0.18509999999999999,0.18509999999999999,0,0.18509999999999999,0.18509999999999999]
[2023,"JQ2","D",0,0,0,0,3.39E-2,3.39E-2,3.3999999999999998E-3,3.3999999999999998E-3,3.3999999999999998E-3,0,3.39E-2,3.39E-2,0,0.16930000000000001,0.16930000000000001,0,0.16930000000000001,0.16930000000000001]
[2023,"JQ3","A",0,0,0,0,0,0,0,0,0,0,0,0,0,0,0,0,0,0]
[2023,"JQ3","B",0,0,0,0,0,0,0,0,0,0,0,0,0,0,0,0,0,0]
[2023,"JQ3","C",0,0,0,0,0,0,0,0,0,0,0,0,0,0,0,0,0,0]
[2023,"JQ3","D",0,0,0,0,0,0,0,0,0,0,0,0,0,0,0,0,0,0]
[2023,"MU1","A",0,0,0,0,3.39E-2,3.39E-2,4.4000000000000003E-3,4.4000000000000003E-3,4.4000000000000003E-3,0,4.4400000000000002E-2,4.4400000000000002E-2,0,0.22220000000000001,0.22220000000000001,0,0.22220000000000001,0.22220000000000001]
[2023,"MU1","B",0,0,0,0,3.39E-2,3.39E-2,4.0000000000000001E-3,4.0000000000000001E-3,4.0000000000000001E-3,0,4.02E-2,4.02E-2,0,0.20100000000000001,0.20100000000000001,0,0.20100000000000001,0.20100000000000001]
[2023,"MU1","C",0,0,0,0,3.39E-2,3.39E-2,3.7000000000000002E-3,3.7000000000000002E-3,3.7000000000000002E-3,3.6999999999999998E-2,3.6999999999999998E-2,3.6999999999999998E-2,0,0.18509999999999999,0.18509999999999999,0,0.18509999999999999,0.18509999999999999]
[2023,"MU1","D",0,0,0,0,3.39E-2,3.39E-2,3.3999999999999998E-3,3.3999999999999998E-3,3.3999999999999998E-3,0,3.39E-2,3.39E-2,0,0.16930000000000001,0.16930000000000001,0,0.16930000000000001,0.16930000000000001]
[2023,"PN1","A",0,0,0,0,3.6499999999999998E-2,3.6499999999999998E-2,6.1000000000000004E-3,6.1000000000000004E-3,6.1000000000000004E-3,0,4.8599999999999997E-2,4.8599999999999997E-2,0,0.24199999999999999,0.24199999999999999,0.24199999999999999,0.24199999999999999,0.24199999999999999]
[2023,"PN1","B",0,0,0,0,3.6499999999999998E-2,3.6499999999999998E-2,5.7000000000000002E-3,5.7000000000000002E-3,5.7000000000000002E-3,0,4.41E-2,4.41E-2,0,0.23319999999999999,0.23319999999999999,0.23319999999999999,0.23319999999999999,0.23319999999999999]
[2023,"PN1","C",0,0,0,0,3.6499999999999998E-2,3.6499999999999998E-2,5.1999999999999998E-3,5.1999999999999998E-3,5.1999999999999998E-3,3.6999999999999998E-2,4.0099999999999997E-2,4.0099999999999997E-2,0,0.2137,0.2137,0.2137,0.2137,0.2137]
[2023,"PN1","D",0,0,0,0,3.6499999999999998E-2,3.6499999999999998E-2,4.7999999999999996E-3,4.7999999999999996E-3,4.7999999999999996E-3,0,3.6499999999999998E-2,3.6499999999999998E-2,0,0.1943,0.1943,0.1943,0.1943,0.1943]
[2023,"PN2","A",0,0,0,0,3.39E-2,3.39E-2,4.4000000000000003E-3,4.4000000000000003E-3,5.4999999999999997E-3,0,4.4400000000000002E-2,4.4400000000000002E-2,0,0.22220000000000001,0.22220000000000001,0,0.22220000000000001,0.22220000000000001]
[2023,"PN2","B",0,0,0,0,3.39E-2,3.39E-2,4.0000000000000001E-3,4.0000000000000001E-3,5.1000000000000004E-3,0,4.02E-2,4.02E-2,0,0.20100000000000001,0.20100000000000001,0,0.20100000000000001,0.20100000000000001]
[2023,"PN2","C",0,0,0,0,3.39E-2,3.39E-2,3.7000000000000002E-3,3.7000000000000002E-3,4.7999999999999996E-3,3.6999999999999998E-2,3.6999999999999998E-2,3.6999999999999998E-2,0,0.18509999999999999,0.18509999999999999,0,0.18509999999999999,0.18509999999999999]
[2023,"PN2","D",0,0,0,0,3.39E-2,3.39E-2,3.3999999999999998E-3,3.3999999999999998E-3,4.4000000000000003E-3,0,3.39E-2,3.39E-2,0,0.16930000000000001,0.16930000000000001,0,0.16930000000000001,0.16930000000000001]
[2023,"PN3","A","-   ",0,0,0,4.8599999999999997E-2,5.3400000000000003E-2,6.3E-3,6.3E-3,7.0000000000000001E-3,0,4.8599999999999997E-2,4.8599999999999997E-2,0,0.25869999999999999,0.28460000000000002,0,0.25869999999999999,0.25869999999999999]
[2023,"PN3","B","-   ",0,0,0,4.41E-2,4.8599999999999997E-2,5.7000000000000002E-3,5.7000000000000002E-3,6.3E-3,0,4.41E-2,4.41E-2,1,0.25059999999999999,0.2757,0,0.23519999999999999,0.23519999999999999]
[2023,"PN3","B",0,0,0,0,"-   ",0,0,0,0,0,0,0,2,0.2429,0.26719999999999999,0,0,0]
[2023,"PN3","B",0,0,0,0,"-   ",0,0,0,0,0,0,0,3,0.23519999999999999,0.25869999999999999,0,0,0]
[2023,"PN3","C","-   ",0,0,0,4.02E-2,4.41E-2,5.3E-3,5.3E-3,5.7000000000000002E-3,4.02E-2,4.02E-2,4.02E-2,0,0.21379999999999999,0.23519999999999999,0,0.21379999999999999,0.21379999999999999]
[2023,"PN3","D","-   ",0,0,0,3.6499999999999998E-2,4.02E-2,4.7999999999999996E-3,4.7999999999999996E-3,5.3E-3,0,3.6499999999999998E-2,3.6499999999999998E-2,1,0.20710000000000001,0.22789999999999999,0,0.1943,0.1943]
[2023,"PN3","D",0,0,0,0,0,0,0,0,0,0,0,0,2,0.20080000000000001,0.2208,0,0,0]
[2023,"PN3","D",0,0,0,0,0,0,0,0,0,0,0,0,3,0.1943,0.21379999999999999,0,0,0]
[2023,"SF1","A",0,0,0,0,3.39E-2,3.39E-2,4.4000000000000003E-3,4.4000000000000003E-3,4.4000000000000003E-3,0,4.4400000000000002E-2,4.4400000000000002E-2,0,0.2666,0.2666,0,0.2666,0.2666]
[2023,"SF1","B",0,0,0,0,3.39E-2,3.39E-2,4.0000000000000001E-3,4.0000000000000001E-3,4.0000000000000001E-3,0,4.02E-2,4.02E-2,0,0.2412,0.2412,0,0.2412,0.2412]
[2023,"SF1","C",0,0,0,0,3.39E-2,3.39E-2,3.7000000000000002E-3,3.7000000000000002E-3,3.7000000000000002E-3,3.6999999999999998E-2,3.6999999999999998E-2,3.6999999999999998E-2,0,0.22220000000000001,0.22220000000000001,0,0.22220000000000001,0.22220000000000001]
[2023,"SF1","D",0,0,0,0,3.39E-2,3.39E-2,3.3999999999999998E-3,3.3999999999999998E-3,3.3999999999999998E-3,0,3.39E-2,3.39E-2,0,0.2031,0.2031,0,0.2031,0.2031]
[2023,"SF3","A",0,0,0,0,3.39E-2,3.39E-2,4.4000000000000003E-3,4.4000000000000003E-3,4.4000000000000003E-3,0,4.4400000000000002E-2,4.4400000000000002E-2,0,0.22220000000000001,0.22220000000000001,0,0.22220000000000001,0.22220000000000001]
[2023,"SF3","B",0,0,0,0,3.39E-2,3.39E-2,4.0000000000000001E-3,4.0000000000000001E-3,4.0000000000000001E-3,0,4.02E-2,4.02E-2,0,0.20100000000000001,0.20100000000000001,0,0.20100000000000001,0.20100000000000001]
[2023,"SF3","C",0,0,0,0,3.39E-2,3.39E-2,3.7000000000000002E-3,3.7000000000000002E-3,3.7000000000000002E-3,3.6999999999999998E-2,3.6999999999999998E-2,3.6999999999999998E-2,0,0.18509999999999999,0.18509999999999999,0,0.18509999999999999,0.18509999999999999]
[2023,"SF3","D",0,0,0,0,3.39E-2,3.39E-2,3.3999999999999998E-3,3.3999999999999998E-3,3.3999999999999998E-3,0,3.39E-2,3.39E-2,0,0.16930000000000001,0.16930000000000001,0,0.16930000000000001,0.16930000000000001]
[2023,"SF4","A",0,0,0,0,3.39E-2,3.39E-2,4.4000000000000003E-3,4.4000000000000003E-3,4.4000000000000003E-3,0,4.4400000000000002E-2,4.4400000000000002E-2,0,0.22220000000000001,0.22220000000000001,0,0.22220000000000001,0.22220000000000001]
[2023,"SF4","B",0,0,0,0,3.39E-2,3.39E-2,4.0000000000000001E-3,4.0000000000000001E-3,4.0000000000000001E-3,0,4.02E-2,4.02E-2,0,0.20100000000000001,0.20100000000000001,0,0.20100000000000001,0.20100000000000001]
[2023,"SF4","C",0,0,0,0,3.39E-2,3.39E-2,3.7000000000000002E-3,3.7000000000000002E-3,3.7000000000000002E-3,3.6999999999999998E-2,3.6999999999999998E-2,3.6999999999999998E-2,0,0.18509999999999999,0.18509999999999999,0,0.18509999999999999,0.18509999999999999]
[2023,"SF4","D",0,0,0,0,3.39E-2,3.39E-2,3.3999999999999998E-3,3.3999999999999998E-3,3.3999999999999998E-3,0,3.39E-2,3.39E-2,0,0.16930000000000001,0.16930000000000001,0,0.16930000000000001,0.16930000000000001]
[2023,"SF6","A",0,0,0,0,3.39E-2,3.39E-2,4.4000000000000003E-3,4.4000000000000003E-3,4.4000000000000003E-3,0,4.4400000000000002E-2,4.4400000000000002E-2,0,0.22220000000000001,0.22220000000000001,0,0.22220000000000001,0.22220000000000001]
[2023,"SF6","B",0,0,0,0,3.39E-2,3.39E-2,4.0000000000000001E-3,4.0000000000000001E-3,4.0000000000000001E-3,0,4.02E-2,4.02E-2,0,0.20100000000000001,0.20100000000000001,0,0.20100000000000001,0.20100000000000001]
[2023,"SF6","C",0,0,0,0,3.39E-2,3.39E-2,3.7000000000000002E-3,3.7000000000000002E-3,3.7000000000000002E-3,3.6999999999999998E-2,3.6999999999999998E-2,3.6999999999999998E-2,0,0.18509999999999999,0.18509999999999999,0,0.18509999999999999,0.18509999999999999]
[2023,"SF6","D",0,0,0,0,3.39E-2,3.39E-2,3.3999999999999998E-3,3.3999999999999998E-3,3.3999999999999998E-3,0,3.39E-2,3.39E-2,0,0.16930000000000001,0.16930000000000001,0,0.16930000000000001,0.16930000000000001]
[2023,"SF7","A",0,0,0,0,3.39E-2,3.39E-2,4.4000000000000003E-3,4.4000000000000003E-3,4.4000000000000003E-3,0,4.4400000000000002E-2,4.4400000000000002E-2,0,0.22220000000000001,0.22220000000000001,0,0.22220000000000001,0.22220000000000001]
[2023,"SF7","B",0,0,0,0,3.39E-2,3.39E-2,4.0000000000000001E-3,4.0000000000000001E-3,4.0000000000000001E-3,0,4.02E-2,4.02E-2,0,0.20100000000000001,0.20100000000000001,0,0.20100000000000001,0.20100000000000001]
[2023,"SF7","C",0,0,0,0,3.39E-2,3.39E-2,3.7000000000000002E-3,3.7000000000000002E-3,3.7000000000000002E-3,3.6999999999999998E-2,3.6999999999999998E-2,3.6999999999999998E-2,0,0.18509999999999999,0.18509999999999999,0,0.18509999999999999,0.18509999999999999]
[2023,"SF7","D",0,0,0,0,3.39E-2,3.39E-2,3.3999999999999998E-3,3.3999999999999998E-3,3.3999999999999998E-3,0,3.39E-2,3.39E-2,0,0.16930000000000001,0.16930000000000001,0,0.16930000000000001,0.16930000000000001]
[2023,"SF8","A",0,0,0,0,3.39E-2,3.39E-2,4.4000000000000003E-3,4.4000000000000003E-3,4.4000000000000003E-3,0,4.4400000000000002E-2,4.4400000000000002E-2,0,0.22220000000000001,0.22220000000000001,0,0.22220000000000001,0.22220000000000001]
[2023,"SF8","B",0,0,0,0,3.39E-2,3.39E-2,4.0000000000000001E-3,4.0000000000000001E-3,4.0000000000000001E-3,0,4.02E-2,4.02E-2,0,0.20100000000000001,0.20100000000000001,0,0.20100000000000001,0.20100000000000001]
[2023,"SF8","C",0,0,0,0,3.39E-2,3.39E-2,3.7000000000000002E-3,3.7000000000000002E-3,3.7000000000000002E-3,3.6999999999999998E-2,3.6999999999999998E-2,3.6999999999999998E-2,0,0.18509999999999999,0.18509999999999999,0,0.18509999999999999,0.18509999999999999]
[2023,"SF8","D",0,0,0,0,3.39E-2,3.39E-2,3.3999999999999998E-3,3.3999999999999998E-3,3.3999999999999998E-3,0,3.39E-2,3.39E-2,0,0.16930000000000001,0.16930000000000001,0,0.16930000000000001,0.16930000000000001]
[2023,"SF9","A",0,0,0,0,3.39E-2,3.39E-2,4.4000000000000003E-3,4.4000000000000003E-3,4.4000000000000003E-3,0,4.4400000000000002E-2,4.4400000000000002E-2,0,0.22220000000000001,0.22220000000000001,0,0.22220000000000001,0.22220000000000001]
[2023,"SF9","B",0,0,0,0,3.39E-2,3.39E-2,4.0000000000000001E-3,4.0000000000000001E-3,4.0000000000000001E-3,0,4.02E-2,4.02E-2,0,0.20100000000000001,0.20100000000000001,0,0.20100000000000001,0.20100000000000001]
[2023,"SF9","C",0,0,0,0,3.39E-2,3.39E-2,3.7000000000000002E-3,3.7000000000000002E-3,3.7000000000000002E-3,3.6999999999999998E-2,3.6999999999999998E-2,3.6999999999999998E-2,0,0.18509999999999999,0.18509999999999999,0,0.18509999999999999,0.18509999999999999]
[2023,"SF9","D",0,0,0,0,3.39E-2,3.39E-2,3.3999999999999998E-3,3.3999999999999998E-3,3.3999999999999998E-3,0,3.39E-2,3.39E-2,0,0.16930000000000001,0.16930000000000001,0,0.16930000000000001,0.16930000000000001]
[2023,"SF10","A",0,0,0,0,3.39E-2,3.39E-2,4.4000000000000003E-3,4.4000000000000003E-3,4.4000000000000003E-3,0,4.4400000000000002E-2,4.4400000000000002E-2,0,0.22220000000000001,0.22220000000000001,0,0.22220000000000001,0.22220000000000001]
[2023,"SF10","B",0,0,0,0,3.39E-2,3.39E-2,4.0000000000000001E-3,4.0000000000000001E-3,4.0000000000000001E-3,0,4.02E-2,4.02E-2,0,0.20100000000000001,0.20100000000000001,0,0.20100000000000001,0.20100000000000001]
[2023,"SF10","C",0,0,0,0,3.39E-2,3.39E-2,3.7000000000000002E-3,3.7000000000000002E-3,3.7000000000000002E-3,3.6999999999999998E-2,3.6999999999999998E-2,3.6999999999999998E-2,0,0.18509999999999999,0.18509999999999999,0,0.18509999999999999,0.18509999999999999]
[2023,"SF10","D",0,0,0,0,3.39E-2,3.39E-2,3.3999999999999998E-3,3.3999999999999998E-3,3.3999999999999998E-3,0,3.39E-2,3.39E-2,0,0.16930000000000001,0.16930000000000001,0,0.16930000000000001,0.16930000000000001]
[2023,"SM1","A",0,0,0,0,3.39E-2,3.39E-2,4.4000000000000003E-3,4.4000000000000003E-3,4.4000000000000003E-3,0,4.4400000000000002E-2,4.4400000000000002E-2,0,0.22220000000000001,0.22220000000000001,0,0.22220000000000001,0.22220000000000001]
[2023,"SM1","B",0,0,0,0,3.39E-2,3.39E-2,4.0000000000000001E-3,4.0000000000000001E-3,4.0000000000000001E-3,0,4.02E-2,4.02E-2,0,0.20100000000000001,0.20100000000000001,0,0.20100000000000001,0.20100000000000001]
[2023,"SM1","C",0,0,0,0,3.39E-2,3.39E-2,3.7000000000000002E-3,3.7000000000000002E-3,3.7000000000000002E-3,3.6999999999999998E-2,3.6999999999999998E-2,3.6999999999999998E-2,0,0.18509999999999999,0.18509999999999999,0,0.18509999999999999,0.18509999999999999]
[2023,"SM1","D",0,0,0,0,3.39E-2,3.39E-2,3.3999999999999998E-3,3.3999999999999998E-3,3.3999999999999998E-3,0,3.39E-2,3.39E-2,0,0.16930000000000001,0.16930000000000001,0,0.16930000000000001,0.16930000000000001]
[2023,"CERH","A",0,0,0,0,3.39E-2,3.39E-2,4.4000000000000003E-3,4.4000000000000003E-3,4.4000000000000003E-3,0,4.4400000000000002E-2,4.4400000000000002E-2,0,0.22220000000000001,0.22220000000000001,0,0.22220000000000001,0.22220000000000001]
[2023,"CERH","B",0,0,0,0,3.39E-2,3.39E-2,4.0000000000000001E-3,4.0000000000000001E-3,4.0000000000000001E-3,0,4.02E-2,4.02E-2,0,0.20100000000000001,0.20100000000000001,0,0.20100000000000001,0.20100000000000001]
[2023,"CERH","C",0,0,0,0,3.39E-2,3.39E-2,3.7000000000000002E-3,3.7000000000000002E-3,3.7000000000000002E-3,3.6999999999999998E-2,3.6999999999999998E-2,3.6999999999999998E-2,0,0.18509999999999999,0.18509999999999999,0,0.18509999999999999,0.18509999999999999]
[2023,"CERH","D",0,0,0,0,3.39E-2,3.39E-2,3.3999999999999998E-3,3.3999999999999998E-3,3.3999999999999998E-3,0,3.39E-2,3.39E-2,0,0.16930000000000001,0.16930000000000001,0,0.16930000000000001,0.16930000000000001]

{"sheet":"Municípios","index":7,"n_rows":863,"n_cols":13,"rows_kept":863,"cut":false,"hidden":true,"merged":[]}
["TOM_Texto","MUNICIPIO","TOM_Num","UF","Selecione o município","COD IBGE","POP RESIDENTE","POP URBANA","POP NA SEDE","ES005 - Volume de esgotos coletado","ES006 - Volume de esgotos tratado","% ESGOTO TRATADO","FAIXA "]
[4123,"BELO HORIZONTE",4123,"MG",{"$f":"PROPER(B2)","v":"Belo Horizonte"},3106200,2375151,2375151,1433290,106982.96,106982.96,1,3]
[4127,"BELO VALE",4127,"MG",{"$f":"PROPER(B3)","v":"Belo Vale"},3106408,7536,3295,3182,1300,1300,1,3]
[4359,"CONGONHAS",4359,"MG","Congonhas",3118007,48519,47236,39696,1542.29,1542.29,1,3]
[4427,"DESTERRO DE ENTRE RIOS",4427,"MG","Desterro De Entre Rios",3121407,7002,3596,2868,622,622,1,3]
[5241,"SAO GOTARDO",5241,"MG","Sao Gotardo",3162104,31819,30061,26156,1612.85,1612.85,1,3]
[5079,"RAUL SOARES",5079,"MG","Raul Soares",3154002,23818,15484,13070,814.02,814.02,1,3]
[4477,"ENTRE RIOS DE MINAS",4477,"MG","Entre Rios De Minas",3123908,14242,9878,9516,1000,1000,1,3]
[4707,"JECEABA",4707,"MG","Jeceaba",3135407,5395,2988,2594,250.63,250.63,1,3]
[4845,"MOEDA",4845,"MG","Moeda",3142304,4689,1789,1614,0,0,{"$error":"#DIV/0!"},1]
[5065,"PRESIDENTE KUBTSCHEK",5065,"MG","Presidente Kubtschek",3153301,2959,2017,2017,208,208,1,3]
[5441,"VISCONDE DO RIO BRANCO",5441,"MG","Visconde Do Rio Branco",3172004,37942,31380,31380,1204.1400000000001,1204.1400000000001,1,3]
[5097,"RIO CASCA",5097,"MG","Rio Casca",3154903,14201,11334,10871,310.31,310.31,1,3]
[4289,"CARMOPOLIS DE MINAS",4289,"MG","Carmopolis De Minas",3114501,17048,11821,11821,735,735,1,3]
[4917,"OURO BRANCO",4917,"MG","Ouro Branco",3145901,35268,31609,31609,1361.55,1361.55,1,3]
[5217,"SAO BRAS DO SUACUI",5217,"MG","Sao Bras Do Suacui",3160900,3513,3129,3129,0,0,{"$error":"#DIV/0!"},1]
[5109,"RIO PARANAIBA",5109,"MG","Rio Paranaiba",3155504,11885,7288,6826,0,0,{"$error":"#DIV/0!"},1]
[4941,"PARA DE MINAS",4941,"MG","Para De Minas",3147105,84215,79599,74720,4715.96,4715.96,1,3]
[4297,"CASA GRANDE",4297,"MG","Casa Grande",3114907,2244,1122,1122,0,0,{"$error":"#DIV/0!"},1]
[4307,"CATAS ALTAS DA NORUEGA",4307,"MG","Catas Altas Da Noruega",3115409,3462,1429,1429,0,0,{"$error":"#DIV/0!"},1]
[4365,"CONSELHEIRO LAFAIETE",4365,"MG","Conselheiro Lafaiete",3118304,116512,111266,110589,4165.91,4165.91,1,3]
[4407,"CRISTIANO OTONI",4407,"MG","Cristiano Otoni",3120409,5007,4156,4117,106.09,106.09,1,3]
[4677,"ITAVERAVA",4677,"MG","Itaverava",3133907,5799,2565,1607,0,0,{"$error":"#DIV/0!"},1]
[4757,"LAMIM",4757,"MG","Lamim",3137908,3452,1511,1511,0,0,{"$error":"#DIV/0!"},1]
[5015,"PIRANGA",5015,"MG","Piranga",3150802,17232,5958,5384,544.74,544.74,1,3]
[5075,"QUELUZITO",5075,"MG","Queluzito",3153806,1861,847,847,32,32,1,3]
[5103,"RIO ESPERA",5103,"MG","Rio Espera",3155207,6070,2403,1760,0,0,{"$error":"#DIV/0!"},1]
[5181,"SANTANA DOS MONTES",5181,"MG","Santana Dos Montes",3159100,3822,2292,1941,80,80,1,3]
[5319,"SENHORA DE OLIVEIRA",5319,"MG","Senhora De Oliveira",3166006,5683,3256,3256,233.39,233.39,1,3]
[4751,"LAGOA SANTA",4751,"MG","Lagoa Santa",3137601,52520,48949,45279,2122.46,2122.46,1,3]
[4821,"MATOZINHOS",4821,"MG","Matozinhos",3141108,33955,30877,28558,1088.1500000000001,1088.1500000000001,1,3]
[4895,"NOVA LIMA",4895,"MG","Nova Lima",3144805,80998,79232,79232,1269.2,1269.2,1,3]
[5077,"RAPOSOS",5077,"MG","Raposos",3153905,15342,14552,14552,518.19000000000005,518.19000000000005,1,3]
[5095,"RIO ACIMA",5095,"MG","Rio Acima",3154804,9090,7944,7944,628,628,1,3]
[4637,"ITABIRITO",4637,"MG","Itabirito",3131901,45449,43566,41832,3501.38,3501.38,1,3]
[4799,"MARIANA",4799,"MG","Mariana",3140001,54219,47642,37706,5323.7,5323.7,1,3]
[4921,"OURO PRETO",4921,"MG","Ouro Preto",3146107,70281,61120,40214,3218.05,3218.05,1,3]
[4249,"CAPIM BRANCO",4249,"MG","Capim Branco",3112505,8881,8090,8090,103.86,103.86,1,3]
[592,"CONFINS",592,"MG","Confins",3117876,5936,5936,5936,107.13,107.13,1,3]
[4985,"PEDRO LEOPOLDO",4985,"MG","Pedro Leopoldo",3149309,58740,49953,20006,1732.93,1732.93,1,3]
[5091,"RIBEIRAO DAS NEVES",5091,"MG","Ribeirao Das Neves",3154606,296317,294153,134444,8816.4500000000007,8816.4500000000007,1,3]
[5133,"SABARA",5133,"MG","Sabara",3156700,126269,123084,40384,3552.41,3552.41,1,3]
[4199,"CAETE",4199,"MG","Caete",3110004,40750,35436,32816,2945.69,2945.69,1,3]
[4691,"JABOTICATUBAS",4691,"MG","Jaboticatubas",3134608,17134,10740,6847,223.69,223.69,1,3]
[4731,"NOVA UNIAO",4731,"MG","Nova Uniao",3136603,5555,2872,1443,300,300,1,3]
[5155,"SANTA LUZIA",5155,"MG","Santa Luzia",3157807,202942,202378,71988,6096.57,6096.57,1,3]
[5179,"SANTANA DO RIACHO",5179,"MG","Santana Do Riacho",3159001,4023,2279,902,0,0,{"$error":"#DIV/0!"},1]
[5365,"TAQUARACU DE MINAS",5365,"MG","Taquaracu De Minas",3168309,3794,1755,1460,48.42,48.42,1,3]
[2649,"SAO JOSE DA LAPA",2649,"MG","Sao Jose Da Lapa",3162955,19799,11400,10408,693.36,693.36,1,3]
[5425,"VESPASIANO",5425,"MG","Vespasiano",3171204,104527,104527,104527,3571.39,3571.39,1,3]
[4003,"ABAETE",4003,"MG","Abaete",3100203,22690,19704,19642,90.98,90.98,1,3]
[4139,"BIQUINHAS",4139,"MG","Biquinhas",3107000,2630,1639,1639,0,0,{"$error":"#DIV/0!"},1]
[4311,"CEDRO DO ABAETE",4311,"MG","Cedro Do Abaete",3115607,1210,1033,1033,59,59,1,3]
[4463,"DORES DO INDAIA",4463,"MG","Dores Do Indaia",3123205,13778,12614,12614,474.52,474.52,1,3]
[4493,"ESTRELA DO INDAIA",4493,"MG","Estrela Do Indaia",3124708,3516,2777,2632,87.38,87.38,1,3]
[4869,"MORADA NOVA DE MINAS",4869,"MG","Morada Nova De Minas",3143500,8255,6457,6253,234.58,234.58,1,3]
[4927,"PAINEIRAS",4927,"MG","Paineiras",3146404,4631,3598,3466,0,0,{"$error":"#DIV/0!"},1]
[5073,"QUARTEL GERAL",5073,"MG","Quartel Geral",3153707,3303,2766,2727,34.86,34.86,1,3]
[5331,"SERRA DA SAUDADE",5331,"MG","Serra Da Saudade",3166600,815,527,527,29.94,29.94,1,3]
[4083,"ARCOS",4083,"MG","Arcos",3104205,36597,33961,33961,2700,2700,1,3]
[4101,"BAMBUI",4101,"MG","Bambui",3105103,22734,19325,19325,1239.71,1239.71,1,3]
[4605,"IGUATAMA",4605,"MG","Iguatama",3130309,8029,6715,6599,299.95,299.95,1,3]
[4705,"JAPARAIBA",4705,"MG","Japaraiba",3135308,3939,2550,2550,328.83,328.83,1,3]
[4825,"MEDEIROS",4825,"MG","Medeiros",3141306,3444,1948,1948,394,394,1,3]
[5363,"TAPIRAI",5363,"MG","Tapirai",3168200,1873,1085,721,100,100,1,3]
[4077,"ARAUJOS",4077,"MG","Araujos",3103900,7883,6812,6812,336.4,336.4,1,3]
[4147,"BOM DESPACHO",4147,"MG",{"$f":"PROPER(B67)","v":"Bom Despacho"},3107406,45624,42963,41712,1849.03,1849.03,1,3]
[4395,"CORREGO DANTA",4395,"MG","Corrego Danta",3119807,3391,2088,1701,520,520,1,3]
[4775,"LUZ",4775,"MG","Luz",3138807,17486,15709,15080,3100,3100,1,3]
[4809,"MARTINHO CAMPOS",4809,"MG","Martinho Campos",3140506,12611,11010,7449,311.2,311.2,1,3]
[4847,"MOEMA",4847,"MG","Moema",3142403,7028,6040,5747,435.52,435.52,1,3]
[4247,"CAPETINGA",4247,"MG","Capetinga",3112406,7089,5919,5185,908.35,908.35,1,3]
[4301,"CASSIA",4301,"MG","Cassia",3115102,17412,14221,14073,3000,3000,1,3]
[4327,"CLARAVAL",4327,"MG","Claraval",3116407,4542,2530,2530,223.54,223.54,1,3]
[4423,"DELFINOPOLIS",4423,"MG","Delfinopolis",3121209,6830,4846,3395,185.28,185.28,1,3]
[4593,"IBIRACI",4593,"MG","Ibiraci",3129707,12176,8208,7978,345.51,345.51,1,3]
[4331,"CLAUDIO",4331,"MG","Claudio",3116605,25771,21154,20047,870.86,870.86,1,3]
[4283,"CARMO DO CAJURU",4283,"MG","Carmo Do Cajuru",3114204,20012,17340,14952,855.92,855.92,1,3]
[4445,"DIVINOPOLIS",4445,"MG","Divinopolis",3122306,213016,207516,202089,8912.02,8912.02,1,3]
[4669,"ITAPECERICA",4669,"MG","Itapecerica",3133501,21377,16503,13347,469.8,469.8,1,3]
[4993,"PERDIGAO",4993,"MG","Perdigao",3149705,8912,7862,7470,500,500,1,3]
[5235,"SAO GONCALO DO PARA",5235,"MG","Sao Goncalo Do Para",3161809,10398,7960,7943,685,685,1,3]
[5291,"SAO SEBASTIAO DO OESTE",5291,"MG","Sao Sebastiao Do Oeste",3164605,5805,3247,3247,365,365,1,3]
[594,"CORREGO FUNDO",594,"MG","Corrego Fundo",3119955,5790,4430,3652,191.25,191.25,1,3]
[4521,"FORMIGA",4521,"MG","Formiga",3126109,65128,59487,58908,3665.08,3665.08,1,3]
[4929,"PAINS",4929,"MG","Pains",3146503,8014,6608,6277,772,772,1,3]
[4161,"BONFIM",4161,"MG","Bonfim",3108107,6818,3332,3043,165.58,165.58,1,3]
[4411,"CRUCILANDIA",4411,"MG","Crucilandia",3120607,4757,2979,2979,242,242,1,3]
[4673,"ITATIAIUCU",4673,"MG","Itatiaiucu",3133709,9928,6221,4812,0,0,{"$error":"#DIV/0!"},1]
[4675,"ITAUNA",4675,"MG","Itauna",3133808,85463,80451,80451,5929.62,5929.62,1,3]
[5007,"PIEDADE DOS GERAIS",5007,"MG","Piedade Dos Gerais",3150406,4640,2122,2122,0,0,{"$error":"#DIV/0!"},1]
[5105,"RIO MANSO",5105,"MG","Rio Manso",3155306,5276,2810,1565,0,0,{"$error":"#DIV/0!"},1]
[4743,"LAGOA DA PRATA",4743,"MG","Lagoa Da Prata",3137205,45984,44938,44794,2723.42,2723.42,1,3]
[2691,"JUATUBA",2691,"MG","Juatuba",3136652,22202,21827,19650,483.82,483.82,1,3]
[4813,"MATEUS LEME",4813,"MG","Mateus Leme",3140704,27856,24679,20003,721.54,721.54,1,3]
[4903,"NOVA SERRANA",4903,"MG","Nova Serrana",3145208,73699,69695,68580,2996.62,2996.62,1,3]
[4279,"CARMO DA MATA",4279,"MG","Carmo Da Mata",3114006,10927,8610,8610,308.83,308.83,1,3]
[4289,"CARMOPOLIS DE MINAS",4289,"MG","Carmopolis De Minas",3114501,17048,11821,11821,735,735,1,3]
[4643,"ITAGUARA",4643,"MG","Itaguara",3132206,12372,9526,9526,613,613,1,3]
[4911,"OLIVEIRA",4911,"MG","Oliveira",3145604,39466,35185,34001,1798.87,1798.87,1,3]
[4953,"PASSA TEMPO",4953,"MG","Passa Tempo",3147709,8197,6385,6385,257.08999999999997,257.08999999999997,1,3]
[5011,"PIRACEMA",5011,"MG","Piracema",3150604,6406,3034,3034,330,330,1,3]
[5223,"SAO FRANCISCO DE PAULA",5223,"MG","Sao Francisco De Paula",3161205,6483,4651,4651,850,850,1,3]
[4519,"FLORESTAL",4519,"MG","Florestal",3126000,6600,5504,5050,210,210,1,3]
[4603,"IGARATINGA",4603,"MG","Igaratinga",3130200,9264,7677,4506,266.3,266.3,1,3]
[4793,"MARAVILHAS",4793,"MG","Maravilhas",3139706,7163,4896,4896,515,515,1,3]
[4915,"ONCA DE PITANGUI",4915,"MG","Onca De Pitangui",3145802,3055,1519,1111,310,310,1,3]
[4941,"PARA DE MINAS",4941,"MG","Para De Minas",3147105,84215,79599,74720,4715.96,4715.96,1,3]
[4991,"PEQUI",4991,"MG","Pequi",3149606,4076,2953,2953,380,380,1,3]
[5261,"SAO JOSE DA VARGINHA",5261,"MG","Sao Jose Da Varginha",3163102,4198,2372,2372,76.08,76.08,1,3]
[4037,"ALPINOPOLIS",4037,"MG","Alpinopolis",3101904,18488,14990,14990,576.77,576.77,1,3]
[4287,"CARMO DO RIO CLARO",4287,"MG","Carmo Do Rio Claro",3114402,20426,14362,14152,638.25,638.25,1,3]
[4341,"CONCEICAO DA APARECIDA",4341,"MG","Conceicao Da Aparecida",3117108,9820,6199,6199,376,376,1,3]
[4525,"FORTALEZA DE MINAS",4525,"MG","Fortaleza De Minas",3126307,4098,2950,2950,205.1,205.1,1,3]
[5731,"ITAU DE MINAS",5731,"MG","Itau De Minas",3133758,14945,14562,14562,1100,1100,1,3]
[4957,"PASSOS",4957,"MG","Passos",3147907,106290,100842,100842,6311.83,6311.83,1,3]
[5057,"PRATAPOLIS",5057,"MG","Pratapolis",3152907,8807,7793,7593,743.12,743.12,1,3]
[5243,"SAO JOAO BATISTA DO GLORIA",5243,"MG","Sao Joao Batista Do Gloria",3162203,6887,5607,5607,317.58999999999997,317.58999999999997,1,3]
[724,"SAO JOSE DA BARRA",724,"MG","Sao Jose Da Barra",3162948,6778,4894,2265,490,490,1,3]
[4351,"CONCEICAO DO PARA",4351,"MG","Conceicao Do Para",3117603,5158,2015,2015,93.6,93.6,1,3]
[4765,"LEANDRO FERREIRA",4765,"MG","Leandro Ferreira",3138302,3205,2152,2152,91.52,91.52,1,3]
[4937,"PAPAGAIOS",4937,"MG","Papagaios",3146909,14175,11920,11920,1030,1030,1,3]
[5027,"PITANGUI",5027,"MG","Pitangui",3151404,25311,22624,21711,0,0,{"$error":"#DIV/0!"},1]
[4255,"CAPITOLIO",4255,"MG","Capitolio",3112802,8183,6502,6502,787.2,787.2,1,3]
[4467,"DORESOPOLIS",4467,"MG","Doresopolis",{"$error":"#N/A"},{"$error":"#N/A"},{"$error":"#N/A"},{"$error":"#N/A"},{"$error":"#N/A"},{"$error":"#N/A"},{"$error":"#N/A"},1]
[5009,"PIMENTA",5009,"MG","Pimenta",3150505,8236,6945,6840,600,600,1,3]
[5029,"PIUMHI",5029,"MG","Piumhi",3151503,31883,28564,28564,1766.59,1766.59,1,3]
[5285,"SAO ROQUE DE MINAS",5285,"MG","Sao Roque De Minas",3164308,6686,4222,3812,203.73,203.73,1,3]
[5411,"VARGEM BONITA",5411,"MG","Vargem Bonita",3170602,2163,1142,1142,71,71,1,3]
[4977,"PEDRA DO INDAIA",4977,"MG","Pedra Do Indaia",3148905,3875,2053,2053,66,66,1,3]
[5207,"SANTO ANTONIO DO MONTE",5207,"MG",{"$f":"PROPER(B131)","v":"Santo Antonio Do Monte"},3160405,25975,22193,22193,971.2,971.2,1,3]
[4657,"ITAMOGI",4657,"MG","Itamogi",3132909,10349,7759,7759,0,0,{"$error":"#DIV/0!"},1]
[4695,"JACUI",4695,"MG","Jacui",3134806,7502,4570,4570,280,280,1,3]
[5293,"SAO SEBASTIAO DO PARAISO",5293,"MG","Sao Sebastiao Do Paraiso",3164704,64980,59953,58243,2766.16,2766.16,1,3]
[5301,"SAO TOMAS DE AQUINO",5301,"MG","Sao Tomas De Aquino",3165107,7093,5522,5522,970,970,1,3]
[4017,"AGUAS FORMOSAS",4017,"MG","Aguas Formosas",3100906,18479,14318,13280,18.260000000000002,18.260000000000002,1,3]
[4131,"BERTOPOLIS",4131,"MG","Bertopolis",3106606,4498,2731,2198,121,121,1,3]
[596,"CRISOLITA",596,"MG","Crisolita",3120151,6047,3489,2053,44.15,44.15,1,3]
[4935,"FRONTEIRA DOS VALES",4935,"MG","Fronteira Dos Vales",3127057,4687,3038,3038,81.27,81.27,1,3]
[4777,"MACHACALIS",4777,"MG","Machacalis",3138906,6976,5749,5749,750,750,1,3]
[706,"SANTA HELENA DE MINAS",706,"MG","Santa Helena De Minas",3157658,6055,3769,3363,94.67,94.67,1,3]
[5405,"UMBURATIBA",5405,"MG","Umburatiba",3170305,2705,1558,1558,30.94,30.94,1,3]
[4021,"AIMORES",4021,"MG","Aimores",3101102,24959,19700,14447,1657.95,1657.95,1,3]
[4033,"ALMENARA",4033,"MG","Almenara",3101706,38775,31750,30522,1169.82,1169.82,1,3]
[4103,"BANDEIRA",4103,"MG","Bandeira",3105202,4987,2377,2377,108.61,108.61,1,3]
[4511,"FELISBURGO",4511,"MG","Felisburgo",3125606,6877,5088,5088,200.96,200.96,1,3]
[4693,"JACINTO",4693,"MG","Jacinto",3134707,12134,9197,7104,233.88,233.88,1,3]
[4715,"JEQUITINHONHA",4715,"MG","Jequitinhonha",3135803,24131,17061,15652,418.04,418.04,1,3]
[4719,"JOAIMA",4719,"MG","Joaima",3136009,14941,10273,9435,267.42,267.42,1,3]
[4729,"JORDANIA",4729,"MG","Jordania",3136504,10324,7221,6700,0,0,{"$error":"#DIV/0!"},1]
[654,"MONTE FORMOSO",654,"MG","Monte Formoso",3143153,4656,1700,1700,59.79,59.79,1,3]
[2661,"PALMOPOLIS",2661,"MG","Palmopolis",3146750,6931,4488,3639,0,0,{"$error":"#DIV/0!"},1]
[5101,"RIO DO PRADO",5101,"MG","Rio Do Prado",3155108,5217,2730,2730,93.64,93.64,1,3]
[5131,"RUBIM",5131,"MG","Rubim",3156601,9919,7703,6997,1386,1386,1,3]
[5141,"SALTO DA DIVISA",5141,"MG","Salto Da Divisa",3157104,6859,5749,5749,0,0,{"$error":"#DIV/0!"},1]
[5161,"SANTA MARIA DO SALTO",5161,"MG","Santa Maria Do Salto",3158102,5284,3742,3742,134.63999999999999,134.63999999999999,1,3]
[5205,"SANTO ANTONIO DO JACINTO",5205,"MG","Santo Antonio Do Jacinto",3160306,11775,6358,5966,1130,1130,1,3]
[4067,"ARACUAI",4067,"MG","Aracuai",3103405,36013,23435,22259,635.72,635.72,1,3]
[4129,"BERILO",4129,"MG","Berilo",3106507,12300,3888,2717,119.86,119.86,1,3]
[4389,"CORONEL MURTA",4389,"MG","Coronel Murta",3119500,9117,6693,5514,127.27,127.27,1,3]
[4529,"FRANCISCO BADARO",4529,"MG","Francisco Badaro",3126505,10248,3191,2512,60,60,1,3]
[4679,"ITINGA",4679,"MG","Itinga",3134004,14407,6554,6354,187.08,187.08,1,3]
[632,"JENIPAPO DE MINAS",632,"MG","Jenipapo De Minas",3135456,7116,2883,2883,102.01,102.01,1,3]
[634,"JOSE GONCALVES DE MINAS",634,"MG","Jose Goncalves De Minas",3136520,4553,1138,1138,39.14,39.14,1,3]
[5433,"VIRGEM DA LAPA",5433,"MG","Virgem Da Lapa",3171600,13619,6840,6106,1170.27,1170.27,1,3]
[4043,"ALVARENGA",4043,"MG","Alvarenga",3102209,4444,2119,2119,178,178,1,3]
[4367,"CONSELHEIRO PENA",4367,"MG","Conselheiro Pena",3118403,22242,17601,13890,931.69,931.69,1,3]
[598,"CUPARAQUE",598,"MG","Cuparaque",3120839,4680,3885,2989,100,100,1,3]
[4545,"GALILEIA",4545,"MG","Galileia",{"$error":"#N/A"},{"$error":"#N/A"},{"$error":"#N/A"},{"$error":"#N/A"},{"$error":"#N/A"},{"$error":"#N/A"},{"$error":"#N/A"},1]
[618,"GOIABEIRA",618,"MG","Goiabeira",3127370,3053,2473,2473,103.2,103.2,1,3]
[714,"SAO GERALDO DO BAIXIO",714,"MG","Sao Geraldo Do Baixio",3161650,3486,2440,2288,170,170,1,3]
[4035,"ALPERCATA",4035,"MG","Alpercata",3101805,7172,5660,3882,198,198,1,3]
[2651,"CAPITAO ANDRADE",2651,"MG","Capitao Andrade",3112653,4925,3573,3573,204,204,1,3]
[4383,"COROACI",4383,"MG","Coroaci",3119203,10270,5181,3690,232.88,232.88,1,3]
[4441,"DIVINO DAS LARANJEIRAS",4441,"MG","Divino Das Laranjeiras",3122108,4937,4108,2231,120,120,1,3]
[4473,"ENGENHEIRO CALDAS",4473,"MG","Engenheiro Caldas",3123700,10280,8325,6530,524,524,1,3]
[4515,"FERNANDES TOURINHO",4515,"MG","Fernandes Tourinho",3125804,3030,2016,1791,102,102,1,3]
[4537,"FREI INOCENCIO",4537,"MG","Frei Inocencio",3126901,8920,6764,6764,0,0,{"$error":"#DIV/0!"},1]
[4553,"GOVERNADOR VALADARES",4553,"MG","Governador Valadares",3127701,263689,253300,244716,13323.32,13323.32,1,3]
[4663,"ITANHOMI",4663,"MG","Itanhomi",3133204,11856,8570,7926,500,500,1,3]
[2655,"JAMPRUCA",2655,"MG","Jampruca",{"$error":"#N/A"},{"$error":"#N/A"},{"$error":"#N/A"},{"$error":"#N/A"},{"$error":"#N/A"},{"$error":"#N/A"},{"$error":"#N/A"},1]
[4801,"MARILAC",4801,"MG","Marilac",3140100,4219,3423,3423,0,0,{"$error":"#DIV/0!"},1]
[5431,"MATHIAS LOBATO",5431,"MG","Mathias Lobato",3171501,3370,3060,3060,0,0,{"$error":"#DIV/0!"},1]
[4829,"MENDES PIMENTEL",4829,"MG","Mendes Pimentel",3141504,6331,3455,3455,0,0,{"$error":"#DIV/0!"},1]
[4883,"NACIP RAYDAN",4883,"MG","Nacip Raydan",3144201,3154,1979,1979,0,0,{"$error":"#DIV/0!"},1]
[712,"SAO FELIX DE MINAS",712,"MG","Sao Felix De Minas",3161056,3382,2089,2089,77.930000000000007,77.930000000000007,1,3]
[5231,"SAO GERALDO DA PIEDADE",5231,"MG","Sao Geraldo Da Piedade",3161601,4389,1054,1054,40,40,1,3]
[5259,"SAO JOSE DA SAFIRA",5259,"MG","Sao Jose Da Safira",3163003,4075,2945,2945,40,40,1,3]
[5353,"SOBRALIA",5353,"MG","Sobralia",3167707,5830,4129,3507,647.85,647.85,1,3]
[5367,"TARUMIRIM",5367,"MG","Tarumirim",3168408,14293,8019,5345,452.9,452.9,1,3]
[5389,"TUMIRITINGA",5389,"MG","Tumiritinga",3169505,6293,4323,3238,526.4,526.4,1,3]
[5439,"VIRGOLANDIA",5439,"MG","Virgolandia",3171907,5658,3402,2825,0,0,{"$error":"#DIV/0!"},1]
[4215,"CAMPANARIO",4215,"MG","Campanario",3110806,3564,2651,2651,0,0,{"$error":"#DIV/0!"},1]
[4653,"ITAMBACURI",4653,"MG","Itambacuri",{"$error":"#N/A"},{"$error":"#N/A"},{"$error":"#N/A"},{"$error":"#N/A"},{"$error":"#N/A"},{"$error":"#N/A"},{"$error":"#N/A"},1]
[4897,"NOVA MODICA",4897,"MG",{"$f":"PROPER(B195)","v":"Nova Modica"},3144904,3790,2328,2328,71.8,71.8,1,3]
[4999,"PESCADOR",4999,"MG","Pescador",3150000,4128,3259,3259,0,0,{"$error":"#DIV/0!"},1]
[5265,"SAO JOSE DO DIVINO",5265,"MG","Sao Jose Do Divino",3163300,3834,2725,2537,76.930000000000007,76.930000000000007,1,3]
[4665,"ITAOBIM",4665,"MG","Itaobim",3133303,21001,15779,15779,302.75,302.75,1,3]
[694,"PONTO DOS VOLANTES",694,"MG","Ponto Dos Volantes",3152170,11345,4031,3226,0,0,{"$error":"#DIV/0!"},1]
[4313,"CENTRAL DE MINAS",4313,"MG","Central De Minas",3115706,6772,5594,4128,297.60000000000002,297.60000000000002,1,3]
[4635,"ITABIRINHA",4635,"MG","Itabirinha",3131802,10692,8370,6442,237.16,237.16,1,3]
[4791,"MANTENA",4791,"MG","Mantena",3139607,27111,21258,20067,2024,2024,1,3]
[662,"NOVA BELEM",662,"MG","Nova Belem",3144672,3732,1348,1243,45.25,45.25,1,3]
[2679,"SAO JOAO DO MANTENINHA",2679,"MG","Sao Joao Do Manteninha",3162575,5188,2905,2428,275.32,275.32,1,3]
[4273,"CARLOS CHAGAS",4273,"MG","Carlos Chagas",3113701,20069,12964,11369,405.75,405.75,1,3]
[4885,"NANUQUE",4885,"MG","Nanuque",3144300,40834,36789,35528,981.46,981.46,1,3]
[5333,"SERRA DOS AIMORES",5333,"MG","Serra Dos Aimores",3166709,8412,6774,6774,107.62,107.62,1,3]
[4019,"AGUAS VERMELHAS",4019,"MG","Aguas Vermelhas",3101003,12722,8941,4701,122.6,122.6,1,3]
[4053,"CACHOEIRA DE PAJEU",4053,"MG","Cachoeira De Pajeu",3102704,8959,4461,3152,0,0,{"$error":"#DIV/0!"},1]
[4339,"COMERCINHO",4339,"MG","Comercinho",3117009,8298,3547,3076,92.85,92.85,1,3]
[600,"CURRAL DE DENTRO",600,"MG","Curral De Dentro",3120870,6913,5837,4520,660,660,1,3]
[604,"DIVISA ALEGRE",604,"MG","Divisa Alegre",3122355,5884,5693,5693,0,0,{"$error":"#DIV/0!"},1]
[2657,"DIVISOPOLIS",2657,"MG","Divisopolis",3122454,8974,6403,6403,79.19,79.19,1,3]
[2659,"MATA VERDE",2659,"MG","Mata Verde",3140555,7874,6388,6388,170.01,170.01,1,3]
[4827,"MEDINA",4827,"MG","Medina",3141405,21026,15092,14284,404.02,404.02,1,3]
[4973,"PEDRA AZUL",4973,"MG","Pedra Azul",3148707,23839,21006,20258,482.53,482.53,1,3]
[4681,"ITUETA",4681,"MG","Itueta",3134103,5830,3299,1208,146,146,1,3]
[5085,"RESPLENDOR",5085,"MG","Resplendor",3154309,17089,12832,10689,423.38,423.38,1,3]
[5189,"SANTA RITA DO ITUETO",5189,"MG","Santa Rita Do Itueto",3159506,5697,2310,1383,0,0,{"$error":"#DIV/0!"},1]
[4093,"ATALEIA",4093,"MG","Ataleia",3104700,14455,7199,5692,137.63999999999999,137.63999999999999,1,3]
[4259,"CARAI",4259,"MG","Carai",3113008,22343,7191,4292,298.5,298.5,1,3]
[2653,"CATUJI",2653,"MG","Catuji",3115458,6708,1692,1692,96.58,96.58,1,3]
[608,"FRANCISCOPOLIS",608,"MG","Franciscopolis",3126752,5800,2398,2060,199,199,1,3]
[4535,"FREI GASPAR",4535,"MG","Frei Gaspar",3126802,5879,1916,1916,97.14,97.14,1,3]
[4645,"ITAIPE",4645,"MG","Itaipe",3132305,11798,4943,4943,173.86,173.86,1,3]
[4739,"LADAINHA",4739,"MG","Ladainha",3137007,16994,4310,3666,181.13,181.13,1,3]
[4783,"MALACACHETA",4783,"MG","Malacacheta",3139201,18776,11818,10300,326.33,326.33,1,3]
[4905,"NOVO CRUZEIRO",4905,"MG","Novo Cruzeiro",3145307,30725,10522,8813,271.51,271.51,1,3]
[666,"NOVO ORIENTE DE MINAS",666,"MG","Novo Oriente De Minas",3145356,10339,4421,4421,191.49,191.49,1,3]
[4923,"OURO VERDE DE MINAS",4923,"MG","Ouro Verde De Minas",3146206,6016,3629,3629,96.37,96.37,1,3]
[4925,"PADRE PARAISO",4925,"MG","Padre Paraiso",3146305,18849,11520,11520,470,470,1,3]
[4969,"PAVAO",4969,"MG","Pavao",3148509,8589,5204,5204,120.37,120.37,1,3]
[5047,"POTE",5047,"MG","Pote",3152402,15667,9337,7823,226.13,226.13,1,3]
[732,"SETUBINHA",732,"MG","Setubinha",3165552,10885,2802,2138,79.02,79.02,1,3]
[5371,"TEOFILO OTONI",5371,"MG","Teofilo Otoni",3168606,134745,110076,105621,3513.18,3513.18,1,3]
[4107,"BARAO DE COCAIS",4107,"MG","Barao De Cocais",3105400,28442,25786,24007,2782,2782,1,3]
[584,"CATAS ALTAS",584,"MG","Catas Altas",3115359,4846,4240,3531,268,268,1,3]
[5143,"SANTA BARBARA",5143,"MG","Santa Barbara",3157203,27876,24794,21809,1060.82,1060.82,1,3]
[4155,"BOM JESUS DO GALHO",4155,"MG","Bom Jesus Do Galho",3107802,15364,10024,5884,0,0,{"$error":"#DIV/0!"},1]
[4267,"CARATINGA",4267,"MG","Caratinga",3113404,85239,70474,61397,2280.75,2280.75,1,3]
[4399,"CORREGO NOVO",4399,"MG","Corrego Novo",3120003,3127,2038,2038,155,155,1,3]
[2663,"ENTRE FOLHAS",2663,"MG","Entre Folhas",3123858,5175,3889,3889,0,0,{"$error":"#DIV/0!"},1]
[626,"IMBE DE MINAS",626,"MG","Imbe De Minas",3130556,6424,2046,2046,74.62,74.62,1,3]
[686,"PIEDADE DE CARATINGA",686,"MG","Piedade De Caratinga",3150158,7110,4602,4602,0,0,{"$error":"#DIV/0!"},1]
[2667,"SANTA BARBARA DO LESTE",2667,"MG","Santa Barbara Do Leste",3157252,7682,3974,3974,0,0,{"$error":"#DIV/0!"},1]
[2669,"SANTA RITA DE MINAS",2669,"MG","Santa Rita De Minas",3159357,6547,4774,4774,0,0,{"$error":"#DIV/0!"},1]
[2671,"UBAPORANGA",2671,"MG","Ubaporanga",3170057,12040,6434,5436,145,145,1,3]
[746,"VARGEM ALEGRE",746,"MG","Vargem Alegre",3170578,6461,4771,4771,0,0,{"$error":"#DIV/0!"},1]
[756,"VERMELHO NOVO",756,"MG","Vermelho Novo",3171154,4689,1852,1852,70.38,70.38,1,3]
[4059,"ANTONIO DIAS",4059,"MG","Antonio Dias",3103009,9565,4672,3448,0,0,{"$error":"#DIV/0!"},1]
[4387,"CORONEL FABRICIANO",4387,"MG","Coronel Fabriciano",3119401,103694,102395,47382,3311.72,3311.72,1,3]
[4699,"JAGUARACU",4699,"MG","Jaguaracu",3135001,2990,2138,1419,394,394,1,3]
[4805,"MARLIERIA",4805,"MG","Marlieria",3140308,4012,2844,918,147,147,1,3]
[582,"CANTAGALO",582,"MG","Cantagalo",3112059,4195,2479,2479,0,0,{"$error":"#DIV/0!"},1]
[4275,"CARMESIA",4275,"MG","Carmesia",3113800,2446,1311,1311,76,76,1,3]
[4335,"COLUNA",4335,"MG","Coluna",3116803,9024,3814,3814,0,0,{"$error":"#DIV/0!"},1]
[4443,"DIVINOLANDIA DE MINAS",4443,"MG","Divinolandia De Minas",3122207,7024,5760,5760,550,550,1,3]
[4451,"DOM JOAQUIM",4451,"MG","Dom Joaquim",3122603,4535,2922,2620,220,220,1,3]
[4461,"DORES DE GUANHAES",4461,"MG",{"$f":"PROPER(B259)","v":"Dores De Guanhaes"},3123106,5223,1622,1622,0,0,{"$error":"#DIV/0!"},1]
[610,"FREI LAGONEGRO",610,"MG","Frei Lagonegro",{"$error":"#N/A"},{"$error":"#N/A"},{"$error":"#N/A"},{"$error":"#N/A"},{"$error":"#N/A"},{"$error":"#N/A"},{"$error":"#N/A"},1]
[4549,"GONZAGA",4549,"MG","Gonzaga",3127503,5921,3237,2842,250,250,1,3]
[4559,"GUANHAES",4559,"MG","Guanhaes",3128006,31262,25421,22866,1285,1285,1,3]
[636,"JOSE RAYDAN",636,"MG","Jose Raydan",3136553,4376,1568,1568,225,225,1,3]
[4811,"MATERLANDIA",4811,"MG","Materlandia",3140605,4595,2011,2011,130,130,1,3]
[4967,"PAULISTAS",4967,"MG","Paulistas",3148400,4918,2303,2303,0,0,{"$error":"#DIV/0!"},1]
[4971,"PECANHA",4971,"MG","Pecanha",3148608,17260,9097,8901,1700,1700,1,3]
[5119,"RIO VERMELHO",5119,"MG","Rio Vermelho",3156007,13645,5481,4912,267.63,267.63,1,3]
[5135,"SABINOPOLIS",5135,"MG","Sabinopolis",3156809,15704,10136,9227,667,667,1,3]
[5149,"SANTA EFIGENIA DE MINAS",5149,"MG","Santa Efigenia De Minas",3157500,4600,3053,3053,0,0,{"$error":"#DIV/0!"},1]
[5163,"SANTA MARIA DO SUACUI",5163,"MG","Santa Maria Do Suacui",3158201,14395,10722,8776,218.58,218.58,1,3]
[5255,"SAO JOAO EVANGELISTA",5255,"MG","Sao Joao Evangelista",3162807,15553,10108,8934,1600,1600,1,3]
[5269,"SAO JOSE DO JACURI",5269,"MG","Sao Jose Do Jacuri",3163508,6553,2006,2006,64.72,64.72,1,3]
[5281,"SAO PEDRO DO SUACUI",5281,"MG","Sao Pedro Do Suacui",3164100,5570,2302,2302,115.83,115.83,1,3]
[5289,"SAO SEBASTIAO DO MARANHAO",5289,"MG","Sao Sebastiao Do Maranhao",3164506,10647,3250,2577,73.849999999999994,73.849999999999994,1,3]
[5309,"SARDOA",5309,"MG","Sardoa",3165503,5594,1997,1997,26,26,1,3]
[5321,"SENHORA DO PORTO",5321,"MG","Senhora Do Porto",3166105,3497,1286,856,0,0,{"$error":"#DIV/0!"},1]
[5437,"VIRGINOPOLIS",5437,"MG","Virginopolis",3171808,10572,6208,6208,432.99,432.99,1,3]
[4449,"DOM CAVATI",4449,"MG","Dom Cavati",3122504,5209,4607,4607,350,350,1,3]
[4585,"IAPU",4585,"MG","Iapu",3129301,10315,7164,6490,413.2,413.2,1,3]
[4617,"INHAPIM",4617,"MG","Inhapim",3130903,24294,13993,10644,267.64999999999998,267.64999999999998,1,3]
[710,"SAO DOMINGOS DAS DORES",710,"MG","Sao Domingos Das Dores",3160959,5408,2578,2578,0,0,{"$error":"#DIV/0!"},1]
[5251,"SAO JOAO DO ORIENTE",5251,"MG","Sao Joao Do Oriente",3162609,7874,6325,5581,0,0,{"$error":"#DIV/0!"},1]
[728,"SAO SEBASTIAO DO ANTA",728,"MG","Sao Sebastiao Do Anta",3164472,5739,4210,4210,0,0,{"$error":"#DIV/0!"},1]
[4009,"ACUCENA",4009,"MG","Acucena",3100500,10276,4805,2535,50,50,1,3]
[4125,"BELO ORIENTE",4125,"MG","Belo Oriente",3106309,23397,19682,6809,1070,1070,1,3]
[4175,"BRAUNAS",4175,"MG","Braunas",3108800,5030,1593,1593,0,0,{"$error":"#DIV/0!"},1]
[576,"BUGRE",576,"MG","Bugre",3109253,3992,1531,1531,67,67,1,3]
[2665,"IPABA",2665,"MG","Ipaba",3131158,16708,15028,13568,597.20000000000005,597.20000000000005,1,3]
[4625,"IPATINGA",4625,"MG","Ipatinga",3131307,239468,236968,148687,9091.08,9091.08,1,3]
[4721,"JOANESIA",4721,"MG","Joanesia",3136108,5425,2062,2062,87.75,87.75,1,3]
[4833,"MESQUITA",4833,"MG","Mesquita",3141702,6069,3819,3401,500,500,1,3]
[656,"NAQUE",656,"MG","Naque",3144359,6341,5961,5961,250.03,250.03,1,3]
[684,"PERIQUITO",684,"MG","Periquito",3149952,7036,5289,3504,246,246,1,3]
[2673,"SANTANA DO PARAISO",2673,"MG","Santana Do Paraiso",3158953,27265,25251,9051,1451.93,1451.93,1,3]
[4153,"BOM JESUS DO AMPARO",4153,"MG","Bom Jesus Do Amparo",3107703,5491,2516,2516,403,403,1,3]
[4517,"FERROS",4517,"MG","Ferros",3125903,10837,5091,3141,67.5,67.5,1,3]
[4633,"ITABIRA",4633,"MG","Itabira",3131703,109783,102316,98554,5245.34,5245.34,1,3]
[4655,"ITAMBE DO MATO DENTRO",4655,"MG","Itambe Do Mato Dentro",3132800,2283,908,908,85,85,1,3]
[4873,"MORRO DO PILAR",4873,"MG","Morro Do Pilar",3143708,3399,2581,2581,0,0,{"$error":"#DIV/0!"},1]
[4949,"PASSABEM",4949,"MG","Passabem",3147501,1766,1012,1012,18.09,18.09,1,3]
[5159,"SANTA MARIA DE ITABIRA",5159,"MG","Santa Maria De Itabira",3158003,10552,6336,6088,249.64,249.64,1,3]
[5209,"SANTO ANTONIO DO RIO ABAIXO",5209,"MG","Santo Antonio Do Rio Abaixo",{"$error":"#N/A"},{"$error":"#N/A"},{"$error":"#N/A"},{"$error":"#N/A"},{"$error":"#N/A"},{"$error":"#N/A"},{"$error":"#N/A"},1]
[5295,"SAO SEBASTIAO DO RIO PRETO",5295,"MG","Sao Sebastiao Do Rio Preto",3164803,1613,876,876,0,0,{"$error":"#DIV/0!"},1]
[4045,"ALVINOPOLIS",4045,"MG","Alvinopolis",3102308,15261,11433,8403,580,580,1,3]
[4119,"BELA VISTA DE MINAS",4119,"MG","Bela Vista De Minas",3106002,10004,9378,9378,578,578,1,3]
[4435,"DIONISIO",4435,"MG","Dionisio",3121803,8739,7165,4210,796,796,1,3]
[4723,"JOAO MONLEVADE",4723,"MG","Joao Monlevade",3136207,73610,73277,73277,3860.92,3860.92,1,3]
[4893,"NOVA ERA",4893,"MG","Nova Era",3144706,17528,15420,13203,676.7,676.7,1,3]
[5113,"RIO PIRACICABA",5113,"MG","Rio Piracicaba",3155702,14149,11272,9567,849,849,1,3]
[5219,"SAO DOMINGOS DO PRATA",5219,"MG","Sao Domingos Do Prata",3161007,17357,10505,8905,560,560,1,3]
[5237,"SAO GONCALO DO RIO ABAIXO",5237,"MG","Sao Goncalo Do Rio Abaixo",3161908,9777,4649,4649,1612,1612,1,3]
[734,"SEM PEIXE",734,"MG","Sem Peixe",{"$error":"#N/A"},{"$error":"#N/A"},{"$error":"#N/A"},{"$error":"#N/A"},{"$error":"#N/A"},{"$error":"#N/A"},{"$error":"#N/A"},1]
[4257,"CAPUTIRA",4257,"MG","Caputira",3112901,9030,3779,3779,660,660,1,3]
[4319,"CHALE",4319,"MG","Chale",3116001,5645,2784,2421,585,585,1,3]
[4753,"LAJINHA",4753,"MG","Lajinha",3137700,19609,12250,10394,470.48,470.48,1,3]
[644,"LUISBURGO",644,"MG","Luisburgo",3138674,6234,1836,1836,180,180,1,3]
[4787,"MANHUACU",4787,"MG","Manhuacu",3139409,79574,64839,50694,4530.6000000000004,4530.6000000000004,1,3]
[4817,"MATIPO",4817,"MG","Matipo",3140902,17639,13832,12042,721.79,721.79,1,3]
[696,"REDUTO",696,"MG","Reduto",3154150,6569,3648,3648,280.22000000000003,280.22000000000003,1,3]
[5157,"SANTA MARGARIDA",5157,"MG","Santa Margarida",3157906,15011,7626,6034,500,500,1,3]
[5177,"SANTANA DO MANHUACU",5177,"MG","Santana Do Manhuacu",3158904,8582,4142,3766,140,140,1,3]
[2677,"SAO JOAO DO MANHUACU",2677,"MG","Sao Joao Do Manhuacu",3162559,10245,4806,4806,147.36000000000001,147.36000000000001,1,3]
[5271,"SAO JOSE DO MANTIMENTO",5271,"MG",{"$f":"PROPER(B323)","v":"Sao Jose Do Mantimento"},3163607,2592,1449,1449,120,120,1,3]
[5351,"SIMONESIA",5351,"MG","Simonesia",3167608,18298,7096,5733,1200,1200,1,3]
[5069,"ALTO JEQUITIBA",5069,"MG","Alto Jequitiba",3153509,8318,4300,3887,270,270,1,3]
[2675,"DURANDE",2675,"MG","Durande",3123528,7423,3547,2481,625,625,1,3]
[4789,"MANHUMIRIM",4789,"MG","Manhumirim",3139508,21382,17043,17043,875,875,1,3]
[650,"MARTINS SOARES",650,"MG","Martins Soares",3140530,7173,2927,1993,0,0,{"$error":"#DIV/0!"},1]
[4347,"CONCEICAO DE IPANEMA",4347,"MG","Conceicao De Ipanema",3117405,4456,1523,1523,506,506,1,3]
[4623,"IPANEMA",4623,"MG","Ipanema",3131208,18170,14200,14200,973,973,1,3]
[4879,"MUTUM",4879,"MG","Mutum",3144003,26661,13790,10575,320.37,320.37,1,3]
[5037,"POCRANE",5037,"MG","Pocrane",3151909,8986,5399,4283,900,900,1,3]
[738,"TAPARUBA",738,"MG","Taparuba",3168051,3137,1405,1405,120,120,1,3]
[4007,"ACAIACA",4007,"MG","Acaiaca",3100401,3920,2553,2553,190,190,1,3]
[4049,"AMPARO DA SERRA",4049,"MG","Amparo Da Serra",3102506,5053,2642,2518,0,0,{"$error":"#DIV/0!"},1]
[4113,"BARRA LONGA",4113,"MG","Barra Longa",3105707,6143,2313,2254,0,0,{"$error":"#DIV/0!"},1]
[4433,"DIOGO DE VASCONCELOS",4433,"MG","Diogo De Vasconcelos",3121704,3848,1099,1099,130,130,1,3]
[4453,"DOM SILVERIO",4453,"MG","Dom Silverio",3122702,5196,4058,4058,300,300,1,3]
[4563,"GUARACIABA",4563,"MG","Guaraciaba",3128204,10223,3218,3218,93.65,93.65,1,3]
[4709,"JEQUERI",4709,"MG","Jequeri",3135506,12848,7293,4717,530,530,1,3]
[672,"ORATORIOS",672,"MG","Oratorios",{"$error":"#N/A"},{"$error":"#N/A"},{"$error":"#N/A"},{"$error":"#N/A"},{"$error":"#N/A"},{"$error":"#N/A"},{"$error":"#N/A"},1]
[5003,"PIEDADE DE PONTE NOVA",5003,"MG","Piedade De Ponte Nova",3150208,4062,3178,3178,0,0,{"$error":"#DIV/0!"},1]
[5041,"PONTE NOVA",5041,"MG","Ponte Nova",3152105,57390,51185,49668,2694.14,2694.14,1,3]
[5099,"RIO DOCE",5099,"MG","Rio Doce",3155009,2465,1653,1653,160,160,1,3]
[5147,"SANTA CRUZ DO ESCALVADO",5147,"MG","Santa Cruz Do Escalvado",3157401,4992,1730,1177,97,97,1,3]
[5409,"URUCANIA",5409,"MG","Urucania",3170503,10291,7946,5748,723.21,723.21,1,3]
[4005,"ABRE CAMPO",4005,"MG","Abre Campo",3100302,13311,7281,6677,205.2,205.2,1,3]
[682,"PEDRA BONITA",682,"MG","Pedra Bonita",{"$error":"#N/A"},{"$error":"#N/A"},{"$error":"#N/A"},{"$error":"#N/A"},{"$error":"#N/A"},{"$error":"#N/A"},{"$error":"#N/A"},1]
[5079,"RAUL SOARES",5079,"MG","Raul Soares",3154002,23818,15484,13070,814.02,814.02,1,3]
[5097,"RIO CASCA",5097,"MG","Rio Casca",3154903,14201,11334,10871,310.31,310.31,1,3]
[5201,"SANTO ANTONIO DO GRAMA",5201,"MG","Santo Antonio Do Grama",3160108,4085,3365,3365,650,650,1,3]
[5267,"SAO JOSE DO GOIABAL",5267,"MG","Sao Jose Do Goiabal",3163409,5636,3689,3689,460,460,1,3]
[5279,"SAO PEDRO DOS FERROS",5279,"MG","Sao Pedro Dos Ferros",3164001,8356,6783,5777,0,0,{"$error":"#DIV/0!"},1]
[5325,"SERICITA",5325,"MG","Sericita",3166303,7128,3718,3193,0,0,{"$error":"#DIV/0!"},1]
[688,"PINGO DAGUA",688,"MG","Pingo Dagua",3150539,4420,4035,4035,500,500,1,3]
[5373,"TIMOTEO",5373,"MG","Timoteo",3168705,81243,81124,70496,2765.02,2765.02,1,3]
[4029,"ALEM PARAIBA",4029,"MG","Alem Paraiba",3101508,34349,32067,29810,1038.69,1038.69,1,3]
[4491,"ESTRELA DALVA",4491,"MG","Estrela Dalva",3124609,2470,1781,1610,61.81,61.81,1,3]
[5021,"PIRAPETINGA",5021,"MG","Pirapetinga",3151107,10364,9102,8417,326.83,326.83,1,3]
[5199,"SANTO ANTONIO DO AVENTUREIRO",5199,"MG","Santo Antonio Do Aventureiro",3160009,3538,2377,1592,0,0,{"$error":"#DIV/0!"},1]
[5443,"VOLTA GRANDE",5443,"MG","Volta Grande",3172103,5070,3802,3497,340,340,1,3]
[4055,"ANDRELANDIA",4055,"MG","Andrelandia",3102803,12173,9810,9810,689,689,1,3]
[4071,"ARANTINA",4071,"MG","Arantina",3103603,2823,2633,2633,113.44,113.44,1,3]
[4149,"BOM JARDIM DE MINAS",4149,"MG","Bom Jardim De Minas",3107505,6501,5576,5420,0,0,{"$error":"#DIV/0!"},1]
[4781,"MADRE DE DEUS DE MINAS",4781,"MG","Madre De Deus De Minas",3139102,4904,3732,3732,119.8,119.8,1,3]
[4837,"MINDURI",4837,"MG","Minduri",3141900,3840,3396,3396,212,212,1,3]
[5005,"PIEDADE DO RIO GRANDE",5005,"MG","Piedade Do Rio Grande",3150307,4709,3477,3045,0,0,{"$error":"#DIV/0!"},1]
[5305,"SAO VICENTE DE MINAS",5305,"MG","Sao Vicente De Minas",3165305,7008,5940,5940,475.86,475.86,1,3]
[2681,"ALFREDO VASCONCELOS",2681,"MG","Alfredo Vasconcelos",3101631,6075,4031,3920,200.97,200.97,1,3]
[4041,"ALTO RIO DOCE",4041,"MG","Alto Rio Doce",3102100,12159,5070,3813,477.9,477.9,1,3]
[4057,"ANTONIO CARLOS",4057,"MG","Antonio Carlos",3102902,11114,7826,4317,2000,2000,1,3]
[4111,"BARBACENA",4111,"MG","Barbacena",3105608,126284,115568,106910,3915.58,3915.58,1,3]
[4117,"BARROSO",4117,"MG","Barroso",3105905,19599,18979,18979,1351.19,1351.19,1,3]
[4135,"BIAS FORTES",4135,"MG","Bias Fortes",3106804,3793,1499,1499,60.13,60.13,1,3]
[4243,"CAPELA NOVA",4243,"MG","Capela Nova",3112208,4755,2132,2132,65,65,1,3]
[4261,"CARANAIBA",4261,"MG","Caranaiba",3113107,3288,1176,1176,60,60,1,3]
[4263,"CARANDAI",4263,"MG","Carandai",3113206,23346,18205,16031,1310,1310,1,3]
[4325,"CIPOTANEA",4325,"MG","Cipotanea",3116308,6547,3014,3014,530,530,1,3]
[4429,"DESTERRO DO MELO",4429,"MG","Desterro Do Melo",3121506,3015,1390,1390,54.15,54.15,1,3]
[4459,"DORES DE CAMPOS",4459,"MG","Dores De Campos",3123007,9299,8457,8457,551.15,551.15,1,3]
[4587,"IBERTIOGA",4587,"MG","Ibertioga",3129400,5036,3457,3457,575,575,1,3]
[5087,"RESSAQUINHA",5087,"MG","Ressaquinha",3154408,4711,3023,2500,0,0,{"$error":"#DIV/0!"},1]
[5145,"SANTA BARBARA DO TUGURIO",5145,"MG","Santa Barbara Do Tugurio",3157302,4570,2187,2054,0,0,{"$error":"#DIV/0!"},1]
[5187,"SANTA RITA DE IBITIPOCA",5187,"MG","Santa Rita De Ibitipoca",3159407,3583,2233,1659,0,0,{"$error":"#DIV/0!"},1]
[5173,"SANTANA DO GARAMBEU",5173,"MG","Santana Do Garambeu",3158706,2234,1652,1652,37,37,1,3]
[5323,"SENHORA DOS REMEDIOS",5323,"MG","Senhora Dos Remedios",3166204,10196,3430,2792,255,255,1,3]
[4137,"BICAS",4137,"MG",{"$f":"PROPER(B387)","v":"Bicas"},3106903,13653,12957,12892,0,0,{"$error":"#DIV/0!"},1]
[4569,"GUARARA",4569,"MG","Guarara",3128501,3929,3487,3487,0,0,{"$error":"#DIV/0!"},1]
[4795,"MAR DE ESPANHA",4795,"MG","Mar De Espanha",3139805,11749,10750,10375,2007,2007,1,3]
[4803,"MARIPA DE MINAS",4803,"MG","Maripa De Minas",3140209,2788,2266,2266,139,139,1,3]
[4989,"PEQUERI",4989,"MG","Pequeri",3149507,3165,2916,2916,0,0,{"$error":"#DIV/0!"},1]
[5311,"SENADOR CORTES",5311,"MG","Senador Cortes",3165602,1988,1512,1308,158,158,1,3]
[564,"ALTO CAPARAO",564,"MG","Alto Caparao",3102050,5297,3964,3964,530,530,1,3]
[4201,"CAIANA",4201,"MG","Caiana",3110103,4968,2618,2165,520,520,1,3]
[4241,"CAPARAO",4241,"MG","Caparao",3112109,5209,2006,2006,70.180000000000007,70.180000000000007,1,3]
[4265,"CARANGOLA",4265,"MG","Carangola",3113305,32296,26059,23343,1335.74,1335.74,1,3]
[4439,"DIVINO",4439,"MG","Divino",3122009,19133,10796,9627,362.7,362.7,1,3]
[4483,"ESPERA FELIZ",4483,"MG","Espera Feliz",3124203,22856,14174,13858,1030.3,1030.3,1,3]
[4505,"FARIA LEMOS",4505,"MG","Faria Lemos",3125309,3376,2332,2332,0,0,{"$error":"#DIV/0!"},1]
[2683,"FERVEDOURO",2683,"MG","Fervedouro",3125952,10349,4764,3740,300,300,1,3]
[674,"ORIZANIA",674,"MG","Orizania",3145877,7284,2221,2221,0,0,{"$error":"#DIV/0!"},1]
[4979,"PEDRA DOURADA",4979,"MG","Pedra Dourada",3149002,2191,1301,1301,160,160,1,3]
[5227,"SAO FRANCISCO DO GLORIA",5227,"MG","Sao Francisco Do Gloria",3161403,5178,3132,3132,273.31,273.31,1,3]
[5383,"TOMBOS",5383,"MG","Tombos",3169208,9537,7602,6592,328,328,1,3]
[4091,"ASTOLFO DUTRA",4091,"MG","Astolfo Dutra",3104601,13049,11882,10322,811,811,1,3]
[4305,"CATAGUASES",4305,"MG","Cataguases",3115300,69757,66780,63638,1927.41,1927.41,1,3]
[4457,"DONA EUSEBIA",4457,"MG","Dona Eusebia",3122900,6001,5133,4090,350,350,1,3]
[4651,"ITAMARATI DE MINAS",4651,"MG","Itamarati De Minas",3132602,4079,3210,3210,0,0,{"$error":"#DIV/0!"},1]
[4843,"MIRAI",4843,"MG","Mirai",3142205,13808,10403,9934,435.09,435.09,1,3]
[5167,"SANTANA DE CATAGUASES",5167,"MG","Santana De Cataguases",3158409,3622,2917,2917,155.12,155.12,1,3]
[726,"SAO SEBASTIAO DA VARGEM ALEGRE",726,"MG","Sao Sebastiao Da Vargem Alegre",3164431,2798,1603,1603,60.12,60.12,1,3]
[4121,"BELMIRO BRAGA",4121,"MG","Belmiro Braga",3106101,3403,1099,598,48.4,48.4,1,3]
[4317,"CHACARA",4317,"MG","Chacara",3115904,2792,1903,1903,100,100,1,3]
[4323,"CHIADOR",4323,"MG","Chiador",{"$error":"#N/A"},{"$error":"#N/A"},{"$error":"#N/A"},{"$error":"#N/A"},{"$error":"#N/A"},{"$error":"#N/A"},{"$error":"#N/A"},1]
[4391,"CORONEL PACHECO",4391,"MG","Coronel Pacheco",3119609,2983,2145,2098,95.5,95.5,1,3]
[620,"GOIANA",620,"MG","Goiana",3127388,3659,2969,2969,557,557,1,3]
[4733,"JUIZ DE FORA",4733,"MG","Juiz De Fora",3136702,516247,510378,506841,25570.17,25570.17,1,3]
[4771,"LIMA DUARTE",4771,"MG","Lima Duarte",3138609,16149,12363,11442,571,571,1,3]
[4815,"MATIAS BARBOSA",4815,"MG","Matias Barbosa",3140803,13435,12944,12944,798,798,1,3]
[4907,"OLARIA",4907,"MG","Olaria",3145406,1976,917,917,59,59,1,3]
[4987,"PEDRO TEIXEIRA",4987,"MG","Pedro Teixeira",3149408,1785,965,965,63.55,63.55,1,3]
[5001,"PIAU",5001,"MG","Piau",{"$error":"#N/A"},{"$error":"#N/A"},{"$error":"#N/A"},{"$error":"#N/A"},{"$error":"#N/A"},{"$error":"#N/A"},{"$error":"#N/A"},1]
[5107,"RIO NOVO",5107,"MG","Rio Novo",3155405,8712,7539,7539,500,500,1,3]
[5117,"RIO PRETO",5117,"MG","Rio Preto",3155900,5292,4451,4082,0,0,{"$error":"#DIV/0!"},1]
[700,"SANTA BARBARA DO MONTE VERDE",700,"MG","Santa Barbara Do Monte Verde",{"$error":"#N/A"},{"$error":"#N/A"},{"$error":"#N/A"},{"$error":"#N/A"},{"$error":"#N/A"},{"$error":"#N/A"},{"$error":"#N/A"},1]
[5185,"SANTA RITA DO JACUTINGA",5185,"MG","Santa Rita Do Jacutinga",{"$error":"#N/A"},{"$error":"#N/A"},{"$error":"#N/A"},{"$error":"#N/A"},{"$error":"#N/A"},{"$error":"#N/A"},{"$error":"#N/A"},1]
[5171,"SANTANA DO DESERTO",5171,"MG","Santana Do Deserto",3158607,3860,1404,1404,0,0,{"$error":"#DIV/0!"},1]
[5349,"SIMAO PEREIRA",5349,"MG","Simao Pereira",3167509,2537,1496,1496,50,50,1,3]
[4087,"ARGIRITA",4087,"MG","Argirita",3104403,2901,2192,2192,152,152,1,3]
[4759,"LARANJAL",4759,"MG","Laranjal",3138005,6465,4738,4471,1000,1000,1,3]
[4767,"LEOPOLDINA",4767,"MG","Leopoldina",3138401,51130,45704,42784,9465,9465,1,3]
[4933,"PALMA",4933,"MG","Palma",3146701,6545,5123,4064,0,0,{"$error":"#DIV/0!"},1]
[5081,"RECREIO",5081,"MG","Recreio",3154101,10299,9073,7865,467,467,1,3]
[4061,"ANTONIO PRADO DE MINAS",4061,"MG","Antonio Prado De Minas",3103108,1671,1003,1003,0,0,{"$error":"#DIV/0!"},1]
[4109,"BARAO DE MONTE ALTO",4109,"MG","Barao De Monte Alto",3105509,5720,4117,1552,0,0,{"$error":"#DIV/0!"},1]
[4497,"EUGENOPOLIS",4497,"MG","Eugenopolis",3124906,10540,7405,6567,0,0,{"$error":"#DIV/0!"},1]
[4841,"MIRADOURO",4841,"MG","Miradouro",3142106,10251,5671,5671,0,0,{"$error":"#DIV/0!"},1]
[4877,"MURIAE",4877,"MG","Muriae",3143906,100765,93225,86814,5081.57,5081.57,1,3]
[4963,"PATROCINIO DO MURIAE",4963,"MG","Patrocinio Do Muriae",3148202,5287,4308,4308,0,0,{"$error":"#DIV/0!"},1]
[698,"ROSARIO DA LIMEIRA",698,"MG","Rosario Da Limeira",3156452,4247,2296,2296,192.2,192.2,1,3]
[5429,"VIEIRAS",5429,"MG","Vieiras",3171402,3731,1853,1480,61,61,1,3]
[4567,"GUARANI",4567,"MG","Guarani",3128402,8678,6876,6876,1350,1350,1,3]
[4831,"MERCES",4831,"MG","Merces",3141603,10368,7256,7256,1500,1500,1,3]
[5025,"PIRAUBA",5025,"MG","Pirauba",3151305,10862,8814,8814,470.06,470.06,1,3]
[5115,"RIO POMBA",5115,"MG","Rio Pomba",3155801,17110,14454,14454,1020,1020,1,3]
[5345,"SILVEIRANIA",5345,"MG","Silveirania",3167301,2192,1429,1244,68.98,68.98,1,3]
[5357,"TABULEIRO",5357,"MG","Tabuleiro",3167905,4079,2701,2701,40.159999999999997,40.159999999999997,1,3]
[4065,"ARACITABA",4065,"MG","Aracitaba",3103306,2058,1641,1641,90,90,1,3]
[4499,"EWBANK DA CAMARA",4499,"MG","Ewbank Da Camara",3125002,3753,3459,2819,0,0,{"$error":"#DIV/0!"},1]
[4913,"OLIVEIRA FORTES",4913,"MG","Oliveira Fortes",3145703,2123,1177,1177,122,122,1,3]
[4931,"PAIVA",4931,"MG",{"$f":"PROPER(B451)","v":"Paiva"},3146602,1558,1219,1219,0,0,{"$error":"#DIV/0!"},1]
[5213,"SANTOS DUMONT",5213,"MG","Santos Dumont",3160702,46284,41320,39738,945.43,945.43,1,3]
[4303,"CONCEICAO DA BARRA DE MINAS",4303,"MG","Conceicao Da Barra De Minas",3115201,3954,2793,2793,59.77,59.77,1,3]
[4393,"CORONEL XAVIER CHAVES",4393,"MG","Coronel Xavier Chaves",3119708,3301,1800,1782,123,123,1,3]
[4747,"LAGOA DOURADA",4747,"MG","Lagoa Dourada",3137403,12256,6889,6889,797.03,797.03,1,3]
[4889,"NAZARENO",4889,"MG","Nazareno",3144508,7954,6046,6046,360,360,1,3]
[5053,"PRADOS",5053,"MG","Prados",3152709,8391,5936,5936,188.88,188.88,1,3]
[5083,"RESENDE COSTA",5083,"MG","Resende Costa",3154200,10913,8776,8478,160.99,160.99,1,3]
[5121,"RITAPOLIS",5121,"MG","Ritapolis",3156106,4925,3407,3407,0,0,{"$error":"#DIV/0!"},1]
[702,"SANTA CRUZ DE MINAS",702,"MG","Santa Cruz De Minas",3157336,7865,7865,7865,904.11,904.11,1,3]
[5249,"SAO JOAO DEL REI",5249,"MG","Sao Joao Del Rei",3162500,84469,79857,76006,12437.04,12437.04,1,3]
[5299,"SAO TIAGO",5299,"MG","Sao Tiago",3165008,10561,8471,7223,231.75,231.75,1,3]
[5375,"TIRADENTES",5375,"MG","Tiradentes",3168804,6961,5376,5376,275.63,275.63,1,3]
[4425,"DESCOBERTO",4425,"MG","Descoberto",3121308,4768,4069,4069,425,425,1,3]
[5123,"ROCHEDO DE MINAS",5123,"MG","Rochedo De Minas",3156205,2116,1914,1914,350,350,1,3]
[5257,"SAO JOAO NEPOMUCENO",5257,"MG","Sao Joao Nepomuceno",3162906,25057,23835,22253,814.22,814.22,1,3]
[4173,"BRAS PIRES",4173,"MG","Bras Pires",3108701,4637,2223,2223,0,0,{"$error":"#DIV/0!"},1]
[4437,"DIVINESIA",4437,"MG","Divinesia",3121902,3293,2175,2175,64,64,1,3]
[4465,"DORES DO TURVO",4465,"MG","Dores Do Turvo",3123304,4462,2030,2030,568,568,1,3]
[4575,"GUIDOVAL",4575,"MG","Guidoval",3128808,7206,5199,5199,325,325,1,3]
[5061,"PRESIDENTE BERNARDES",5061,"MG","Presidente Bernardes",3153103,5537,1642,1642,55.6,55.6,1,3]
[5125,"RODEIRO",5125,"MG","Rodeiro",3156304,6867,5556,5556,445.37,445.37,1,3]
[5313,"SENADOR FIRMINO",5313,"MG","Senador Firmino",3165701,7230,4683,4683,140.47999999999999,140.47999999999999,1,3]
[5379,"TOCANTINS",5379,"MG","Tocantins",3169000,15823,12909,12909,1036,1036,1,3]
[5397,"UBA",5397,"MG","Uba",3169901,101519,97636,92095,2944.02,2944.02,1,3]
[4073,"ARAPONGA",4073,"MG","Araponga",3103702,8152,3041,2116,150,150,1,3]
[4203,"CAJURI",4203,"MG","Cajuri",3110202,4047,2096,1725,80,80,1,3]
[4233,"CANAA",4233,"MG","Canaa",3111705,4628,1859,1859,195,195,1,3]
[4333,"COIMBRA",4333,"MG","Coimbra",3116704,7054,5156,5156,0,0,{"$error":"#DIV/0!"},1]
[4479,"ERVALIA",4479,"MG","Ervalia",3124005,17946,9470,9470,0,0,{"$error":"#DIV/0!"},1]
[4965,"PAULA CANDIDO",4965,"MG","Paula Candido",3148301,9271,4936,4261,1000,1000,1,3]
[4975,"PEDRA DO ANTA",4975,"MG","Pedra Do Anta",3148806,3365,2192,2192,77.739999999999995,77.739999999999995,1,3]
[5045,"PORTO FIRME",5045,"MG","Porto Firme",3152303,10417,4831,4831,0,0,{"$error":"#DIV/0!"},1]
[5275,"SAO MIGUEL DO ANTA",5275,"MG","Sao Miguel Do Anta",3163805,6760,3746,3746,0,0,{"$error":"#DIV/0!"},1]
[5369,"TEIXEIRAS",5369,"MG","Teixeiras",3168507,11355,7623,7623,0,0,{"$error":"#DIV/0!"},1]
[5427,"VICOSA",5427,"MG","Vicosa",3171303,72220,67305,56455,2850,2850,1,3]
[4579,"GUIRICEMA",4579,"MG","Guiricema",3129004,8707,4225,3320,140,140,1,3]
[5229,"SAO GERALDO",5229,"MG","Sao Geraldo",3161502,10263,7270,6648,1625,1625,1,3]
[5441,"VISCONDE DO RIO BRANCO",5441,"MG","Visconde Do Rio Branco",3172004,37942,31380,31380,1204.1400000000001,1204.1400000000001,1,3]
[4145,"BOCAIUVA",4145,"MG","Bocaiuva",3107307,46654,36600,35672,1495.5,1495.5,1,3]
[4475,"ENGENHEIRO NAVARRO",4475,"MG","Engenheiro Navarro",3123809,7122,4750,4750,90.82,90.82,1,3]
[4531,"FRANCISCO DUMONT",4531,"MG","Francisco Dumont",3126604,4863,3197,3197,46.03,46.03,1,3]
[622,"GUARACIAMA",622,"MG","Guaraciama",3128253,4718,3025,3025,0,0,{"$error":"#DIV/0!"},1]
[670,"OLHOS DAGUA",670,"MG","Olhos Dagua",3145455,5267,2866,2866,0,0,{"$error":"#DIV/0!"},1]
[4171,"BRASILIA DE MINAS",4171,"MG","Brasilia De Minas",3108602,31213,20675,17599,504.12,504.12,1,3]
[580,"CAMPO AZUL",580,"MG","Campo Azul",3111150,3684,1551,1551,200,200,1,3]
[624,"IBIRACATU",624,"MG","Ibiracatu",3129657,6155,3123,1730,0,0,{"$error":"#DIV/0!"},1]
[630,"JAPONVAR",630,"MG","Japonvar",3135357,8298,3050,2540,0,0,{"$error":"#DIV/0!"},1]
[2695,"LONTRA",2695,"MG","Lontra",3138658,8397,5630,5038,67.94,67.94,1,3]
[646,"LUISLANDIA",646,"MG","Luislandia",3138682,6400,2989,2519,0,0,{"$error":"#DIV/0!"},1]
[4839,"MIRABELA",4839,"MG","Mirabela",3142007,13042,10028,9252,149.87,149.87,1,3]
[680,"PATIS",680,"MG","Patis",3147956,5579,2301,2301,0,0,{"$error":"#DIV/0!"},1]
[5399,"UBAI",5399,"MG","Ubai",3170008,11681,5665,4455,0,0,{"$error":"#DIV/0!"},1]
[4485,"ESPINOSA",4485,"MG","Espinosa",3124302,31113,18023,17263,50.26,50.26,1,3]
[614,"GAMELEIRAS",614,"MG","Gameleiras",3127339,5139,1413,1211,0,0,{"$error":"#DIV/0!"},1]
[2895,"MAMONAS",2895,"MG","Mamonas",3139250,6321,2812,2715,27.7,27.7,1,3]
[4857,"MONTE AZUL",4857,"MG","Monte Azul",3142908,21994,12418,12418,42.79,42.79,1,3]
[4169,"BOTUMIRIM",4169,"MG","Botumirim",3108503,6497,3470,2280,42.59,42.59,1,3]
[4405,"CRISTALIA",4405,"MG","Cristalia",3120300,5760,3053,3053,46.45,46.45,1,3]
[4533,"FRANCISCO SA",4533,"MG","Francisco Sa",3126703,24912,14897,12846,457.15,457.15,1,3]
[4555,"GRAO MOGOL",4555,"MG","Grao Mogol",3127800,15024,5391,4763,85.38,85.38,1,3]
[586,"CATUTI",586,"MG","Catuti",3115474,5102,2978,2286,28.2,28.2,1,3]
[2893,"JAIBA",2893,"MG","Jaiba",3135050,33587,17635,17635,277.19,277.19,1,3]
[4701,"JANAUBA",4701,"MG","Janauba",3135100,66803,60570,56315,671.28,671.28,1,3]
[4819,"MATO VERDE",4819,"MG",{"$f":"PROPER(B515)","v":"Mato Verde"},3141009,12684,9459,8865,99.8,99.8,1,3]
[2697,"MONTEZUMA",2697,"MG","Montezuma",3143450,7464,3079,3079,142,142,1,3]
[664,"NOVA PORTEIRINHA",664,"MG","Nova Porteirinha",3145059,7398,4069,4069,62.88,62.88,1,3]
[678,"PAI PEDRO",678,"MG","Pai Pedro",3146552,5934,1749,1749,0,0,{"$error":"#DIV/0!"},1]
[5043,"PORTEIRINHA",5043,"MG","Porteirinha",3152204,37627,19338,16140,347.9,347.9,1,3]
[5089,"RIACHO DOS MACHADOS",5089,"MG","Riacho Dos Machados",3154507,9360,4499,3780,92.61,92.61,1,3]
[708,"SANTO ANTONIO DO RETIRO",708,"MG","Santo Antonio Do Retiro",3160454,6955,1590,1590,47.82,47.82,1,3]
[736,"SERRANOPOLIS DE MINAS",736,"MG","Serranopolis De Minas",3166956,4425,1728,1728,0,0,{"$error":"#DIV/0!"},1]
[752,"VERDELANDIA",752,"MG","Verdelandia",3171030,8346,4762,4762,0,0,{"$error":"#DIV/0!"},1]
[572,"BONITO DE MINAS",572,"MG","Bonito De Minas",3108255,9673,2209,2209,0,0,{"$error":"#DIV/0!"},1]
[590,"CONEGO MARINHO",590,"MG","Conego Marinho",3117836,7101,1915,922,0,0,{"$error":"#DIV/0!"},1]
[4641,"ITACARAMBI",4641,"MG","Itacarambi",3132107,17720,13799,13799,194.3,194.3,1,3]
[4703,"JANUARIA",4703,"MG","Januaria",3135209,65463,41322,35985,413.32,413.32,1,3]
[2899,"PEDRAS DE MARIA DA CRUZ",2899,"MG","Pedras De Maria Da Cruz",3149150,10315,6328,5763,37.119999999999997,37.119999999999997,1,3]
[718,"SAO JOAO DAS MISSOES",718,"MG","Sao Joao Das Missoes",3162450,11715,2446,2446,0,0,{"$error":"#DIV/0!"},1]
[640,"JUVENILIA",640,"MG","Juvenilia",3136959,5708,4392,3004,12.88,12.88,1,3]
[4785,"MANGA",4785,"MG","Manga",3139300,19813,13848,13307,85.28,85.28,1,3]
[2897,"MATIAS CARDOSO",2897,"MG","Matias Cardoso",3140852,9979,5136,4072,0,0,{"$error":"#DIV/0!"},1]
[652,"MIRAVANIA",652,"MG","Miravania",3142254,4549,1079,1079,0,0,{"$error":"#DIV/0!"},1]
[4853,"MONTALVANIA",4853,"MG","Montalvania",3142700,15862,10239,7718,38.31,38.31,1,3]
[4253,"CAPITAO ENEAS",4253,"MG","Capitao Eneas",3112703,14206,11520,9716,176.54,176.54,1,3]
[4329,"CLARO DOS POCOES",4329,"MG","Claro Dos Pocoes",3116506,7775,5251,3793,66.87,66.87,1,3]
[4375,"CORACAO DE JESUS",4375,"MG","Coracao De Jesus",3118809,26033,14766,11742,200.02,200.02,1,3]
[616,"GLAUCILANDIA",616,"MG","Glaucilandia",3127354,2962,1048,1048,32.58,32.58,1,3]
[4639,"ITACAMBIRA",4639,"MG","Itacambira",3132008,4988,1006,1006,0,0,{"$error":"#DIV/0!"},1]
[4735,"JURAMENTO",4735,"MG","Juramento",3136801,4113,2272,2272,55.11,55.11,1,3]
[4865,"MONTES CLAROS",4865,"MG","Montes Claros",3143302,361915,344427,338381,11890.23,11890.23,1,3]
[716,"SAO JOAO DA LAGOA",716,"MG","Sao Joao Da Lagoa",3162252,4656,2435,2161,0,0,{"$error":"#DIV/0!"},1]
[5247,"SAO JOAO DA PONTE",5247,"MG","Sao Joao Da Ponte",3162401,25358,8656,5842,78.430000000000007,78.430000000000007,1,3]
[720,"SAO JOAO DO PACUI",720,"MG","Sao Joao Do Pacui",3162658,4060,1921,1555,0,0,{"$error":"#DIV/0!"},1]
[5417,"VARZELANDIA",5417,"MG","Varzelandia",3170909,19116,8904,7428,57.05,57.05,1,3]
[4187,"BURITIZEIRO",4187,"MG","Buritizeiro",3109402,26922,23630,22014,0,0,{"$error":"#DIV/0!"},1]
[4591,"IBIAI",4591,"MG","Ibiai",3129608,7839,6004,5439,65.94,65.94,1,3]
[4711,"JEQUITAI",4711,"MG","Jequitai",3135605,8005,5504,5504,0,0,{"$error":"#DIV/0!"},1]
[4745,"LAGOA DOS PATOS",4745,"MG","Lagoa Dos Patos",3137304,4225,3079,3079,55.78,55.78,1,3]
[5023,"PIRAPORA",5023,"MG","Pirapora",3151206,53368,52385,52385,1261,1261,1,3]
[692,"PONTO CHIQUE",692,"MG","Ponto Chique",3152131,3966,2581,2581,45,45,1,3]
[5151,"SANTA FE DE MINAS",5151,"MG","Santa Fe De Minas",3157609,3968,2291,2291,0,0,{"$error":"#DIV/0!"},1]
[612,"FRUTA DE LEITE",612,"MG","Fruta De Leite",3127073,5940,2036,2036,0,0,{"$error":"#DIV/0!"},1]
[638,"JOSENOPOLIS",638,"MG","Josenopolis",3136579,4566,2444,2444,46.43,46.43,1,3]
[668,"NOVORIZONTE",668,"MG","Novorizonte",3145372,4963,1717,1717,18.05,18.05,1,3]
[676,"PADRE CARVALHO",676,"MG","Padre Carvalho",3146255,5834,3462,3462,63.44,63.44,1,3]
[5129,"RUBELITA",5129,"MG","Rubelita",3156502,7772,2516,2516,46.11,46.11,1,3]
[5139,"SALINAS",5139,"MG","Salinas",3157005,39178,30716,28544,1018.04,1018.04,1,3]
[704,"SANTA CRUZ DE SALINAS",704,"MG","Santa Cruz De Salinas",3157377,4397,1151,1151,40.97,40.97,1,3]
[588,"CHAPADA GAUCHA",588,"MG","Chapada Gaucha",3116159,10805,5761,4200,0,0,{"$error":"#DIV/0!"},1]
[2693,"ICARAI DE MINAS",2693,"MG","Icarai De Minas",3130051,10746,2986,2986,44.79,44.79,1,3]
[690,"PINTOPOLIS",690,"MG","Pintopolis",3150570,7211,2532,2397,100,100,1,3]
[5221,"SAO FRANCISCO",5221,"MG","Sao Francisco",3161106,53828,34204,30315,612.49,612.49,1,3]
[5283,"SAO ROMAO",5283,"MG","Sao Romao",3164209,10276,6469,6183,74.52,74.52,1,3]
[2699,"URUCUIA",2699,"MG","Urucuia",3170529,13604,6165,6165,42,42,1,3]
[570,"BERIZAL",570,"MG","Berizal",3106655,4370,2485,2485,0,0,{"$error":"#DIV/0!"},1]
[628,"INDAIABIRA",628,"MG","Indaiabira",3130655,7330,2742,1408,32.69,32.69,1,3]
[660,"NINHEIRA",660,"MG","Ninheira",3144656,9815,2623,2623,0,0,{"$error":"#DIV/0!"},1]
[5111,"RIO PARDO DE MINAS",5111,"MG","Rio Pardo De Minas",3155603,29099,11692,11169,127.63,127.63,1,3]
[5253,"SAO JOAO DO PARAISO",5253,"MG","Sao Joao Do Paraiso",3162708,22319,10235,10235,229.83,229.83,1,3]
[5359,"TAIOBEIRAS",5359,"MG","Taiobeiras",3168002,30917,25060,25060,453.29,453.29,1,3]
[748,"VARGEM GRANDE DO RIO PARDO",748,"MG","Vargem Grande Do Rio Pardo",3170651,4733,2421,2421,0,0,{"$error":"#DIV/0!"},1]
[4761,"LASSANCE",4761,"MG","Lassance",3138104,6484,3882,3882,0,0,{"$error":"#DIV/0!"},1]
[5415,"VARZEA DA PALMA",5415,"MG","Varzea Da Palma",3170800,35809,31313,29175,345.38,345.38,1,3]
[4079,"ARAXA",4079,"MG","Araxa",3104007,93672,92284,92230,4591.78,4591.78,1,3]
[4983,"PEDRINOPOLIS",4983,"MG","Pedrinopolis",3149200,3490,2927,2927,79.25,79.25,1,3]
[4995,"PERDIZES",4995,"MG","Perdizes",3149804,14404,9935,9525,876,876,1,3]
[5153,"SANTA JULIANA",5153,"MG","Santa Juliana",3157708,11337,9795,9394,2138,2138,1,3]
[5361,"TAPIRA",5361,"MG",{"$f":"PROPER(B579)","v":"Tapira"},3168101,4112,2744,2744,0,0,{"$error":"#DIV/0!"},1]
[4345,"CONCEICAO DAS ALAGOAS",4345,"MG","Conceicao Das Alagoas",3117306,23043,20880,19937,1451,1451,1,3]
[4337,"COMENDADOR GOMES",4337,"MG","Comendador Gomes",3116902,2972,1508,1508,100,100,1,3]
[4539,"FRONTEIRA",4539,"MG","Fronteira",3127008,14041,13095,12156,508.37,508.37,1,3]
[4541,"FRUTAL",4541,"MG","Frutal",3127107,53468,46089,44309,2334.8000000000002,2334.8000000000002,1,3]
[4667,"ITAPAGIPE",4667,"MG","Itapagipe",3133402,13656,9558,9558,1930,1930,1,3]
[5013,"PIRAJUBA",5013,"MG","Pirajuba",3150703,4656,4131,4131,228.2,228.2,1,3]
[5031,"PLANURA",5031,"MG","Planura",3151602,10384,10091,10091,980,980,1,3]
[4229,"CAMPOS ALTOS",4229,"MG","Campos Altos",3111507,14206,12913,12816,2050,2050,1,3]
[4589,"IBIA",4589,"MG","Ibia",3129509,23218,19646,19185,1172.3399999999999,1172.3399999999999,1,3]
[5059,"PRATINHA",5059,"MG","Pratinha",3153004,3265,1759,1759,140,140,1,3]
[2685,"CARNEIRINHO",2685,"MG","Carneirinho",3114550,9471,6975,4287,285.2,285.2,1,3]
[4687,"ITURAMA",4687,"MG","Iturama",3134400,34456,32598,31029,1382.37,1382.37,1,3]
[2687,"LIMEIRA DO OESTE",2687,"MG","Limeira Do Oeste",3138625,6890,5017,5017,226.23,226.23,1,3]
[5225,"SAO FRANCISCO DE SALES",5225,"MG","Sao Francisco De Sales",3161304,5776,4332,4332,701,701,1,3]
[742,"UNIAO DE MINAS",742,"MG","Uniao De Minas",3170438,4418,2726,2726,99.17,99.17,1,3]
[4363,"CONQUISTA",4363,"MG","Conquista",3118205,6526,5671,5185,241.03,241.03,1,3]
[5137,"SACRAMENTO",5137,"MG","Sacramento",3156908,23896,19275,19247,1577.76,1577.76,1,3]
[4013,"AGUA COMPRIDA",4013,"MG","Agua Comprida",3100708,2025,1520,1474,300,300,1,3]
[4227,"CAMPO FLORIDO",4227,"MG","Campo Florido",3111408,6870,5208,5208,279.29000000000002,279.29000000000002,1,3]
[602,"DELTA",602,"MG","Delta",3121258,8089,7584,7584,1000,1000,1,3]
[5401,"UBERABA",5401,"MG","Uberaba",3170107,295988,289376,285662,21320.53,21320.53,1,3]
[5423,"VERISSIMO",5423,"MG","Verissimo",3171105,3483,2037,2037,79.05,79.05,1,3]
[4069,"ARAGUARI",4069,"MG","Araguari",3103504,109801,102583,100592,15181.96,15181.96,1,3]
[4299,"CASCALHO RICO",4299,"MG","Cascalho Rico",3115003,2857,1796,1154,127.8,127.8,1,3]
[4613,"INDIANOPOLIS",4613,"MG","Indianopolis",3130705,6190,4056,4056,254,254,1,3]
[4221,"CAMPINA VERDE",4221,"MG","Campina Verde",3111101,19324,14433,13766,566.29999999999995,566.29999999999995,1,3]
[4195,"CACHOEIRA DOURADA",4195,"MG","Cachoeira Dourada",3109808,2505,2225,2225,140,140,1,3]
[4251,"CAPINOPOLIS",4251,"MG","Capinopolis",3112604,15290,14302,14302,640,640,1,3]
[4627,"IPIACU",4627,"MG","Ipiacu",{"$error":"#N/A"},{"$error":"#N/A"},{"$error":"#N/A"},{"$error":"#N/A"},{"$error":"#N/A"},{"$error":"#N/A"},{"$error":"#N/A"},1]
[4075,"ARAPUA",4075,"MG","Arapua",3103801,2775,2088,2088,270,270,1,3]
[4285,"CARMO DO PARANAIBA",4285,"MG","Carmo Do Paranaiba",3114303,29735,25200,24360,1055.49,1055.49,1,3]
[5109,"RIO PARANAIBA",5109,"MG","Rio Paranaiba",3155504,11885,7288,6826,0,0,{"$error":"#DIV/0!"},1]
[4001,"ABADIA DOS DOURADOS",4001,"MG","Abadia Dos Dourados",3100104,6704,4189,4189,0,0,{"$error":"#DIV/0!"},1]
[4385,"COROMANDEL",4385,"MG","Coromandel",3119302,27547,21665,19680,285,285,1,3]
[4235,"CANAPOLIS",4235,"MG","Canapolis",3111804,11365,10180,10180,600.83000000000004,600.83000000000004,1,3]
[4315,"CENTRALINA",4315,"MG","Centralina",3115805,10266,9314,9314,158.22,158.22,1,3]
[4581,"GURINHATA",4581,"MG","Gurinhata",3129103,6137,2692,2306,274.60000000000002,274.60000000000002,1,3]
[4683,"ITUIUTABA",4683,"MG","Ituiutaba",3134202,97171,93125,93125,5238.32,5238.32,1,3]
[574,"BRASILANDIA DE MINAS",574,"MG","Brasilandia De Minas",3108552,14226,12372,12372,139.44999999999999,139.44999999999999,1,3]
[4725,"JOAO PINHEIRO",4725,"MG","Joao Pinheiro",3136306,45260,36761,30452,1414.12,1414.12,1,3]
[4469,"DOURADOQUARA",4469,"MG","Douradoquara",3123502,1841,1233,1233,88.77,88.77,1,3]
[4495,"ESTRELA DO SUL",4495,"MG","Estrela Do Sul",3124807,7446,6057,2309,126.59,126.59,1,3]
[4557,"GRUPIARA",4557,"MG","Grupiara",3127909,1373,1173,1173,0,0,{"$error":"#DIV/0!"},1]
[4631,"IRAI DE MINAS",4631,"MG","Irai De Minas",3131604,6467,5158,5158,912,912,1,3]
[4861,"MONTE CARMELO",4861,"MG","Monte Carmelo",3143104,45772,40100,40100,2385.6,2385.6,1,3]
[5127,"ROMARIA",5127,"MG","Romaria",{"$error":"#N/A"},{"$error":"#N/A"},{"$error":"#N/A"},{"$error":"#N/A"},{"$error":"#N/A"},{"$error":"#N/A"},{"$error":"#N/A"},1]
[4571,"GUARDA MOR",4571,"MG","Guarda Mor",3128600,6565,3688,3688,168.95,168.95,1,3]
[4939,"PARACATU",4939,"MG","Paracatu",3147006,84718,73772,73772,2634.2,2634.2,1,3]
[4741,"LAGAMAR",4741,"MG","Lagamar",3137106,7600,5128,4449,433.9,433.9,1,3]
[4749,"LAGOA FORMOSA",4749,"MG","Lagoa Formosa",3137502,17161,12967,12582,855.62,855.62,1,3]
[2905,"LAGOA GRANDE",2905,"MG","Lagoa Grande",3137536,8631,6408,6408,182,182,1,3]
[4959,"PATOS DE MINAS",4959,"MG","Patos De Minas",3148004,138710,127724,124353,7228.21,7228.21,1,3]
[5067,"PRESIDENTE OLEGARIO",5067,"MG","Presidente Olegario",3153400,18577,13150,11860,1504,1504,1,3]
[5233,"SAO GONCALO DO ABAETE",5233,"MG","Sao Goncalo Do Abaete",3161700,6264,4168,4013,146.27000000000001,146.27000000000001,1,3]
[750,"VARJAO DE MINAS",750,"MG","Varjao De Minas",3170750,6054,5021,5021,0,0,{"$error":"#DIV/0!"},1]
[5419,"VAZANTE",5419,"MG","Vazante",3171006,19723,15919,15465,712.28,712.28,1,3]
[4413,"CRUZEIRO DA FORTALEZA",4413,"MG","Cruzeiro Da Fortaleza",3120706,3934,3361,1918,399.78,399.78,1,3]
[4577,"GUIMARANIA",4577,"MG","Guimarania",3128907,7265,5924,5924,267.08,267.08,1,3]
[4961,"PATROCINIO",4961,"MG","Patrocinio",3148103,82471,72758,67409,3633,3633,1,3]
[5335,"SERRA DO SALITRE",5335,"MG","Serra Do Salitre",3166808,10549,7755,7146,520,520,1,3]
[5055,"PRATA",5055,"MG","Prata",3152808,25802,19381,19075,1209,1209,1,3]
[5195,"SANTA VITORIA",5195,"MG","Santa Vitoria",3159803,18138,14926,13550,796,796,1,3]
[4823,"MATUTINA",4823,"MG","Matutina",3141207,3761,2693,2693,550,550,1,3]
[5193,"SANTA ROSA DA SERRA",5193,"MG",{"$f":"PROPER(B643)","v":"Santa Rosa Da Serra"},3159704,3224,1973,1973,0,0,{"$error":"#DIV/0!"},1]
[5241,"SAO GOTARDO",5241,"MG","Sao Gotardo",3162104,31819,30061,26156,1612.85,1612.85,1,3]
[5377,"TIROS",5377,"MG","Tiros",3168903,6906,4815,4798,551,551,1,3]
[2903,"ARAPORA",2903,"MG","Arapora",3103751,6144,5898,5898,455.3,455.3,1,3]
[5391,"TUPACIGUARA",5391,"MG","Tupaciguara",3169604,24188,22042,22042,2719.67,2719.67,1,3]
[4855,"MONTE ALEGRE DE MINAS",4855,"MG","Monte Alegre De Minas",3142809,19619,14506,14506,601.14,601.14,1,3]
[4899,"NOVA PONTE",4899,"MG","Nova Ponte",3145000,12812,10991,9061,793.76,793.76,1,3]
[5403,"UBERLANDIA",5403,"MG","Uberlandia",3170206,604013,587266,584102,52441.78,52441.78,1,3]
[4089,"ARINOS",4089,"MG","Arinos",3104502,17674,10854,10226,1570,1570,1,3]
[4163,"BONFINOPOLIS DE MINAS",4163,"MG","Bonfinopolis De Minas",3108206,5865,4137,4137,205.11,205.11,1,3]
[4185,"BURITIS",4185,"MG","Buritis",3109303,22737,16100,14397,281.62,281.62,1,3]
[578,"CABECEIRA GRANDE",578,"MG","Cabeceira Grande",3109451,6453,5297,2445,0,0,{"$error":"#DIV/0!"},1]
[606,"DOM BOSCO",606,"MG","Dom Bosco",3122470,3814,2052,2052,120,120,1,3]
[4523,"FORMOSO",4523,"MG","Formoso",3126208,8177,5173,4664,0,0,{"$error":"#DIV/0!"},1]
[658,"NATALANDIA",658,"MG","Natalandia",{"$error":"#N/A"},{"$error":"#N/A"},{"$error":"#N/A"},{"$error":"#N/A"},{"$error":"#N/A"},{"$error":"#N/A"},{"$error":"#N/A"},1]
[2901,"RIACHINHO",2901,"MG","Riachinho",3154457,8007,4435,4435,0,0,{"$error":"#DIV/0!"},1]
[5407,"UNAI",5407,"MG","Unai",3170404,77565,62329,60967,4007.29,4007.29,1,3]
[744,"URUANA DE MINAS",744,"MG","Uruana De Minas",3170479,3235,1818,1818,120,120,1,3]
[4031,"ALFENAS",4031,"MG","Alfenas",3101607,73774,69176,68608,3484.32,3484.32,1,3]
[4039,"ALTEROSA",4039,"MG","Alterosa",3102001,13717,10002,8516,1177,1177,1,3]
[4085,"AREADO",4085,"MG","Areado",3104304,13731,11525,11483,0,0,{"$error":"#DIV/0!"},1]
[4447,"DIVISA NOVA",4447,"MG","Divisa Nova",3122405,5763,4659,4659,224,224,1,3]
[4503,"FAMA",4503,"MG","Fama",3125200,2350,1515,1515,59.43,59.43,1,3]
[5337,"SERRANIA",5337,"MG","Serrania",3166907,7542,6576,6576,785,785,1,3]
[4051,"ANDRADAS",4051,"MG","Andradas",3102605,37270,28026,27311,3720,3720,1,3]
[4597,"IBITIURA DE MINAS",4597,"MG","Ibitiura De Minas",3129905,3382,2370,2370,115,115,1,3]
[5183,"SANTA RITA DE CALDAS",5183,"MG","Santa Rita De Caldas",3159209,9027,5655,4714,212.47,212.47,1,3]
[4141,"BOA ESPERANCA",4141,"MG","Boa Esperanca",3107109,38516,32191,32191,1951.6,1951.6,1,3]
[4373,"COQUEIRAL",4373,"MG","Coqueiral",3118700,9289,6588,6317,347.04,347.04,1,3]
[4561,"GUAPE",4561,"MG","Guape",3128105,13872,7174,7082,700,700,1,3]
[4609,"ILICINEA",4609,"MG","Ilicinea",3130507,11488,9096,9096,290,290,1,3]
[4209,"CAMANDUCAIA",4209,"MG","Camanducaia",3110509,21080,15469,11018,669.51,669.51,1,3]
[4671,"ITAPEVA",4671,"MG","Itapeva",3133600,8664,4511,4511,220.63,220.63,1,3]
[4157,"BOM REPOUSO",4157,"MG","Bom Repouso",3107901,10457,5679,5679,244.58,244.58,1,3]
[4211,"CAMBUI",4211,"MG","Cambui",3110608,26488,22359,21425,1272.43,1272.43,1,3]
[4397,"CORREGO DO BOM JESUS",4397,"MG","Corrego Do Bom Jesus",3119906,3730,2049,2049,125,125,1,3]
[4489,"ESTIVA",4489,"MG","Estiva",3124500,10845,4899,4550,310,310,1,3]
[2689,"SENADOR AMARAL",2689,"MG","Senador Amaral",3165578,5219,3101,2243,172.3,172.3,1,3]
[4015,"AGUANIL",4015,"MG","Aguanil",3100807,4054,2345,2345,120,120,1,3]
[4207,"CAMACHO",4207,"MG","Camacho",3110400,3154,1458,1458,0,0,{"$error":"#DIV/0!"},1]
[4223,"CAMPO BELO",4223,"MG","Campo Belo",3111200,51544,48626,48542,2117.7399999999998,2117.7399999999998,1,3]
[4237,"CANA VERDE",4237,"MG","Cana Verde",3111903,5589,4068,4068,200,200,1,3]
[4239,"CANDEIAS",4239,"MG","Candeias",3112000,14595,10206,10206,0,0,{"$error":"#DIV/0!"},1]
[4403,"CRISTAIS",4403,"MG","Cristais",3120201,11286,8845,8845,1900,1900,1,3]
[5175,"SANTANA DO JACARE",5175,"MG","Santana Do Jacare",3158805,4607,4428,4428,374,374,1,3]
[4225,"CAMPO DO MEIO",4225,"MG","Campo Do Meio",3111309,11476,10059,10059,443,443,1,3]
[4231,"CAMPOS GERAIS",4231,"MG","Campos Gerais",3111606,27600,19156,16692,1225.46,1225.46,1,3]
[4023,"AIURUOCA",4023,"MG","Aiuruoca",3101201,6162,3123,3123,78.540000000000006,78.540000000000006,1,3]
[4097,"BAEPENDI",4097,"MG","Baependi",3104908,18307,13247,13247,1689,1689,1,3]
[4143,"BOCAINA DE MINAS",4143,"MG","Bocaina De Minas",3107208,5007,2396,1425,130,130,1,3]
[4295,"CARVALHOS",4295,"MG","Carvalhos",3114808,4556,2437,2268,79.89,79.89,1,3]
[4309,"CAXAMBU",4309,"MG","Caxambu",3115508,21705,21252,21252,805.41,805.41,1,3]
[4353,"CONCEICAO DO RIO VERDE",4353,"MG","Conceicao Do Rio Verde",3117702,12949,11454,11211,0,0,{"$error":"#DIV/0!"},1]
[4415,"CRUZILIA",4415,"MG","Cruzilia",3120805,14591,13286,13286,483.72,483.72,1,3]
[4769,"LIBERDADE",4769,"MG","Liberdade",3138500,5346,3869,3869,0,0,{"$error":"#DIV/0!"},1]
[4955,"PASSA VINTE",4955,"MG","Passa Vinte",3147808,2079,1305,1238,0,0,{"$error":"#DIV/0!"},1]
[5327,"SERITINGA",5327,"MG","Seritinga",3166402,1789,1483,1483,73.56,73.56,1,3]
[5339,"SERRANOS",5339,"MG","Serranos",{"$error":"#N/A"},{"$error":"#N/A"},{"$error":"#N/A"},{"$error":"#N/A"},{"$error":"#N/A"},{"$error":"#N/A"},{"$error":"#N/A"},1]
[4501,"EXTREMA",4501,"MG","Extrema",3125101,28599,26023,26023,1648.3,1648.3,1,3]
[5381,"TOLEDO",5381,"MG","Toledo",3169109,5764,2190,2190,0,0,{"$error":"#DIV/0!"},1]
[4565,"GUARANESIA",4565,"MG","Guaranesia",3128303,18714,16836,15404,1125,1125,1,3]
[4573,"GUAXUPE",4573,"MG","Guaxupe",3128709,49430,46480,46480,2123.37,2123.37,1,3]
[4737,"JURUAIA",4737,"MG","Juruaia",3136900,9238,4514,4514,600,600,1,3]
[5277,"SAO PEDRO DA UNIAO",5277,"MG","Sao Pedro Da Uniao",3163904,5040,2781,2781,144.02000000000001,144.02000000000001,1,3]
[4177,"BRAZOPOLIS",4177,"MG",{"$f":"PROPER(B707)","v":"Brazopolis"},3108909,14661,7891,7063,750,750,1,3]
[4343,"CONCEICAO DAS PEDRAS",4343,"MG","Conceicao Das Pedras",3117207,2749,1509,1509,85,85,1,3]
[4421,"DELFIM MOREIRA",4421,"MG","Delfim Moreira",3121100,7971,3025,2897,310,310,1,3]
[4647,"ITAJUBA",4647,"MG","Itajuba",3132404,90658,82764,82554,3599.93,3599.93,1,3]
[4797,"MARIA DA FE",4797,"MG","Maria Da Fe",3139904,14216,8383,8094,900,900,1,3]
[4807,"MARMELOPOLIS",4807,"MG","Marmelopolis",3140407,2968,1557,1557,305,305,1,3]
[4981,"PEDRALVA",4981,"MG","Pedralva",3149101,11467,5563,5563,185.15,185.15,1,3]
[5017,"PIRANGUCU",5017,"MG","Pirangucu",3150901,5217,1772,1772,71,71,1,3]
[5019,"PIRANGUINHO",5019,"MG","Piranguinho",3151008,8016,4953,3587,203.53,203.53,1,3]
[5263,"SAO JOSE DO ALEGRE",5263,"MG","Sao Jose Do Alegre",3163201,3996,2901,2901,450,450,1,3]
[5421,"WENCESLAU BRAZ",5421,"MG","Wenceslau Braz",3172202,2553,1270,1179,0,0,{"$error":"#DIV/0!"},1]
[4025,"ALAGOA",4025,"MG","Alagoa",{"$error":"#N/A"},{"$error":"#N/A"},{"$error":"#N/A"},{"$error":"#N/A"},{"$error":"#N/A"},{"$error":"#N/A"},{"$error":"#N/A"},1]
[4659,"ITAMONTE",4659,"MG","Itamonte",3133006,14003,9612,9612,0,0,{"$error":"#DIV/0!"},1]
[4661,"ITANHANDU",4661,"MG","Itanhandu",3133105,14175,11925,11925,1361.56,1361.56,1,3]
[4951,"PASSA QUATRO",4951,"MG","Passa Quatro",3147600,15582,11985,10061,1000,1000,1,3]
[5051,"POUSO ALTO",5051,"MG","Pouso Alto",{"$error":"#N/A"},{"$error":"#N/A"},{"$error":"#N/A"},{"$error":"#N/A"},{"$error":"#N/A"},{"$error":"#N/A"},{"$error":"#N/A"},1]
[5297,"SAO SEBASTIAO DO RIO VERDE",5297,"MG","Sao Sebastiao Do Rio Verde",3164902,2110,1321,1321,130,130,1,3]
[5435,"VIRGINIA",5435,"MG","Virginia",{"$error":"#N/A"},{"$error":"#N/A"},{"$error":"#N/A"},{"$error":"#N/A"},{"$error":"#N/A"},{"$error":"#N/A"},{"$error":"#N/A"},1]
[4027,"ALBERTINA",4027,"MG","Albertina",{"$error":"#N/A"},{"$error":"#N/A"},{"$error":"#N/A"},{"$error":"#N/A"},{"$error":"#N/A"},{"$error":"#N/A"},{"$error":"#N/A"},1]
[4697,"JACUTINGA",4697,"MG","Jacutinga",{"$error":"#N/A"},{"$error":"#N/A"},{"$error":"#N/A"},{"$error":"#N/A"},{"$error":"#N/A"},{"$error":"#N/A"},{"$error":"#N/A"},1]
[4159,"BOM SUCESSO",4159,"MG","Bom Sucesso",3108008,17243,14194,13428,670,670,1,3]
[4291,"CARRANCAS",4291,"MG","Carrancas",3114600,3948,2612,2454,0,0,{"$error":"#DIV/0!"},1]
[4599,"IBITURUNA",4599,"MG","Ibituruna",3130002,2866,2485,2384,94.98,94.98,1,3]
[4607,"IJACI",4607,"MG","Ijaci",3130408,5859,5605,5547,350,350,1,3]
[4615,"INGAI",4615,"MG","Ingai",3130804,2629,1630,1630,200,200,1,3]
[4685,"ITUMIRIM",4685,"MG","Itumirim",3134301,6139,4704,2940,231,231,1,3]
[4689,"ITUTINGA",4689,"MG","Itutinga",3134509,3913,2756,2756,450,450,1,3]
[4763,"LAVRAS",4763,"MG","Lavras",3138203,92200,87856,87856,3868.79,3868.79,1,3]
[4773,"LUMINARIAS",4773,"MG","Luminarias",3138708,5422,4166,4166,60,60,1,3]
[4891,"NEPOMUCENO",4891,"MG","Nepomuceno",3144607,25733,19936,19140,1900,1900,1,3]
[5093,"RIBEIRAO VERMELHO",5093,"MG","Ribeirao Vermelho",3154705,3826,3543,3543,113,113,1,3]
[4293,"CARVALHOPOLIS",4293,"MG","Carvalhopolis",3114709,3341,2459,2459,480,480,1,3]
[4779,"MACHADO",4779,"MG","Machado",3139003,38688,32068,30598,1831.93,1831.93,1,3]
[5033,"POCO FUNDO",5033,"MG","Poco Fundo",3151701,15959,9281,8545,0,0,{"$error":"#DIV/0!"},1]
[4081,"ARCEBURGO",4081,"MG","Arceburgo",3104106,9509,8179,8179,376.33,376.33,1,3]
[4863,"MONTE SANTO DE MINAS",4863,"MG","Monte Santo De Minas",3143203,21234,16423,14603,754.98,754.98,1,3]
[4867,"MONTE SIAO",4867,"MG","Monte Siao",3143401,21203,16268,15530,869.38,869.38,1,3]
[4151,"BOM JESUS DA PENHA",4151,"MG","Bom Jesus Da Penha",3107604,3887,2825,2825,220,220,1,3]
[4189,"CABO VERDE",4189,"MG","Cabo Verde",3109501,13823,7627,6507,293.47000000000003,293.47000000000003,1,3]
[4859,"MONTE BELO",4859,"MG","Monte Belo",3143005,13061,9058,8075,27.9,27.9,1,3]
[4881,"MUZAMBINHO",4881,"MG","Muzambinho",3144102,20430,15729,15729,3000,3000,1,3]
[4901,"NOVA RESENDE",4901,"MG","Nova Resende",3145109,15374,8858,8306,0,0,{"$error":"#DIV/0!"},1]
[4181,"BUENO BRANDAO",4181,"MG","Bueno Brandao",3109105,10892,5674,5674,203.65,203.65,1,3]
[4611,"INCONFIDENTES",4611,"MG","Inconfidentes",3130606,6908,3678,3678,219,219,1,3]
[4875,"MUNHOZ",4875,"MG","Munhoz",3143807,6257,3319,3319,0,0,{"$error":"#DIV/0!"},1]
[4919,"OURO FINO",4919,"MG","Ouro Fino",3146008,31568,23763,22240,1424.33,1424.33,1,3]
[4943,"PARAGUACU",4943,"MG","Paraguacu",3147204,20245,16679,16458,860.2,860.2,1,3]
[4355,"CONCEICAO DOS OUROS",4355,"MG","Conceicao Dos Ouros",3117801,10388,8123,8123,651,651,1,3]
[4369,"CONSOLACAO",4369,"MG","Consolacao",3118502,1727,950,950,41,41,1,3]
[4547,"GONCALVES",4547,"MG","Goncalves",3127404,4220,1164,1164,43.36,43.36,1,3]
[4945,"PARAISOPOLIS",4945,"MG","Paraisopolis",3147303,19379,16058,15381,902,902,1,3]
[5307,"SAPUCAI MIRIM",5307,"MG","Sapucai Mirim",3165404,6241,3783,3783,148.34,148.34,1,3]
[4997,"PERDOES",4997,"MG","Perdoes",3149903,20087,17776,16969,699.27,699.27,1,3]
[5197,"SANTO ANTONIO DO AMPARO",5197,"MG","Santo Antonio Do Amparo",3159902,17345,15187,12940,553,553,1,3]
[4105,"BANDEIRA DO SUL",4105,"MG","Bandeira Do Sul",3105301,5338,4870,4825,207,207,1,3]
[4167,"BOTELHOS",4167,"MG","Botelhos",3108404,14920,11366,9245,376.9,376.9,1,3]
[4205,"CALDAS",4205,"MG","Caldas",3110301,13633,7739,6393,251.42,251.42,1,3]
[4219,"CAMPESTRE",4219,"MG","Campestre",3111002,20686,10959,10959,1005,1005,1,3]
[4629,"IPUIUNA",4629,"MG","Ipuiuna",3131505,9521,7448,7448,218.97,218.97,1,3]
[5035,"POCOS DE CALDAS",5035,"MG","Pocos De Caldas",3151800,152435,148722,148017,10187.629999999999,10187.629999999999,1,3]
[4165,"BORDA DA MATA",4165,"MG","Borda Da Mata",3108305,17118,13718,11996,447.69,447.69,1,3]
[4271,"CAREACU",4271,"MG","Careacu",3113602,6298,4702,4702,535,535,1,3]
[4357,"CONGONHAL",4357,"MG","Congonhal",3117900,10468,7755,7755,330.22,330.22,1,3]
[4487,"ESPIRITO SANTO DO DOURADO",4487,"MG","Espirito Santo Do Dourado",3124401,4429,1683,1683,249.12,249.12,1,3]
[4583,"HELIODORA",4583,"MG",{"$f":"PROPER(B771)","v":"Heliodora"},3129202,6121,4430,4430,350,350,1,3]
[4887,"NATERCIA",4887,"MG","Natercia",3144409,4658,2760,2760,106.19,106.19,1,3]
[5049,"POUSO ALEGRE",5049,"MG","Pouso Alegre",3152501,130615,119590,118240,5885.91,5885.91,1,3]
[5245,"SAO JOAO DA MATA",5245,"MG","Sao Joao Da Mata",3162302,2731,1752,1752,100,100,1,3]
[5287,"SAO SEBASTIAO DA BELA VISTA",5287,"MG","Sao Sebastiao Da Bela Vista",{"$error":"#N/A"},{"$error":"#N/A"},{"$error":"#N/A"},{"$error":"#N/A"},{"$error":"#N/A"},{"$error":"#N/A"},{"$error":"#N/A"},1]
[5315,"SENADOR JOSE BENTO",5315,"MG","Senador Jose Bento",3165800,1868,683,683,95,95,1,3]
[5347,"SILVIANOPOLIS",5347,"MG","Silvianopolis",3167400,6027,3645,3645,135,135,1,3]
[740,"TOCOS DO MOJI",740,"MG","Tocos Do Moji",3169059,3950,1018,1018,0,0,{"$error":"#DIV/0!"},1]
[4193,"CACHOEIRA DE MINAS",4193,"MG","Cachoeira De Minas",3109709,11034,7064,6264,442,442,1,3]
[5191,"SANTA RITA DO SAPUCAI",5191,"MG","Santa Rita Do Sapucai",3159605,37754,32458,32458,1395.09,1395.09,1,3]
[4217,"CAMPANHA",4217,"MG","Campanha",3110905,15433,13326,13326,483.1,483.1,1,3]
[4379,"CORDISLANDIA",4379,"MG","Cordislandia",3119005,3435,2757,2757,88,88,1,3]
[5239,"SAO GONCALO DO SAPUCAI",5239,"MG","Sao Goncalo Do Sapucai",3162005,23906,19742,19134,3500,3500,1,3]
[5395,"TURVOLANDIA",5395,"MG","Turvolandia",3169802,4658,2910,2910,0,0,{"$error":"#DIV/0!"},1]
[4281,"CARMO DE MINAS",4281,"MG","Carmo De Minas",3114105,13750,10189,10189,947.61,947.61,1,3]
[4409,"CRISTINA",4409,"MG","Cristina",3120508,10210,5955,5955,800,800,1,3]
[4455,"DOM VICOSO",4455,"MG","Dom Vicoso",3122801,2994,998,998,81,81,1,3]
[4717,"JESUANIA",4717,"MG","Jesuania",3135902,4768,3094,3094,250,250,1,3]
[4755,"LAMBARI",4755,"MG","Lambari",3137809,19554,14036,14036,831.17,831.17,1,3]
[4909,"OLIMPIO NORONHA",4909,"MG","Olimpio Noronha",3145505,2533,2249,2249,395,395,1,3]
[5273,"SAO LOURENCO",5273,"MG","Sao Lourenco",3163706,41657,41657,41657,2440.12,2440.12,1,3]
[5355,"SOLEDADE DE MINAS",5355,"MG","Soledade De Minas",3167806,5676,3761,3761,109.2,109.2,1,3]
[4213,"CAMBUQUIRA",4213,"MG","Cambuquira",3110707,12602,10457,10457,220.81,220.81,1,3]
[4277,"CARMO DA CACHOEIRA",4277,"MG","Carmo Da Cachoeira",3113909,11836,8966,8615,307.67,307.67,1,3]
[5215,"SAO BENTO ABADE",5215,"MG","Sao Bento Abade",3160801,4577,4238,4238,230,230,1,3]
[5303,"SAO TOME DAS LETRAS",5303,"MG","Sao Tome Das Letras",3165206,6655,3857,3857,0,0,{"$error":"#DIV/0!"},1]
[5385,"TRES CORACOES",5385,"MG","Tres Coracoes",3169307,72765,65826,64862,2718,2718,1,3]
[5165,"SANTANA DA VARGEM",5165,"MG","Santana Da Vargem",3158300,7231,5278,5278,204.87,204.87,1,3]
[5387,"TRES PONTAS",5387,"MG","Tres Pontas",3169406,53860,46280,46160,2674.26,2674.26,1,3]
[4471,"ELOI MENDES",4471,"MG","Eloi Mendes",3123601,25220,20374,20374,1683.17,1683.17,1,3]
[4851,"MONSENHOR PAULO",4851,"MG","Monsenhor Paulo",3142601,8161,6133,6133,339.68,339.68,1,3]
[5413,"VARGINHA",5413,"MG","Varginha",3170701,123081,119061,119034,5698.33,5698.33,1,3]
[4133,"BETIM",4133,"MG","Betim",3106705,378089,375331,375331,13215.6,13215.6,1,3]
[4179,"BRUMADINHO",4179,"MG","Brumadinho",3109006,33973,28642,12975,1023.27,1023.27,1,3]
[4481,"ESMERALDAS",4481,"MG","Esmeraldas",3124104,60271,56215,13630,457.54,457.54,1,3]
[4601,"IGARAPE",4601,"MG","Igarape",3130101,34851,32661,32661,947.84,947.84,1,3]
[722,"SAO JOAQUIM DE BICAS",722,"MG","Sao Joaquim De Bicas",3162922,25537,18599,18599,585.77,585.77,1,3]
[4371,"CONTAGEM",4371,"MG","Contagem",3118601,603442,601400,332699,22847.62,22847.62,1,3]
[4095,"AUGUSTO DE LIMA",4095,"MG","Augusto De Lima",3104809,4960,2924,2924,15.33,15.33,1,3]
[4183,"BUENOPOLIS",4183,"MG","Buenopolis",3109204,10292,7767,7136,227.45,227.45,1,3]
[4381,"CORINTO",4381,"MG","Corinto",3119104,23914,21194,20128,593.79999999999995,593.79999999999995,1,3]
[4417,"CURVELO",4417,"MG","Curvelo",3120904,74219,67382,63291,2431.19,2431.19,1,3]
[4513,"FELIXLANDIA",4513,"MG","Felixlandia",3125705,14121,10922,10008,0,0,{"$error":"#DIV/0!"},1]
[4621,"INIMUTABA",4621,"MG","Inimutaba",3131109,6724,4743,4743,0,0,{"$error":"#DIV/0!"},1]
[4727,"JOAQUIM FELICIO",4727,"MG","Joaquim Felicio",3136405,4305,2526,2526,45.45,45.45,1,3]
[4849,"MONJOLOS",4849,"MG","Monjolos",3142502,2360,1403,692,0,0,{"$error":"#DIV/0!"},1]
[4871,"MORRO DA GARCA",4871,"MG","Morro Da Garca",3143609,2660,1522,1522,100,100,1,3]
[5039,"POMPEU",5039,"MG","Pompeu",3152006,29105,25740,25200,1916.53,1916.53,1,3]
[5063,"PRESIDENTE JUSCELINO",5063,"MG","Presidente Juscelino",3153202,3908,1846,1846,31,31,1,3]
[5211,"SANTO HIPOLITO",5211,"MG","Santo Hipolito",3160603,3238,2249,1623,0,0,{"$error":"#DIV/0!"},1]
[4115,"TRES MARIAS",4115,"MG","Tres Marias",3169356,28318,26840,25815,853.83,853.83,1,3]
[4011,"AGUA BOA",4011,"MG","Agua Boa",3100609,15195,7035,4951,0,0,{"$error":"#DIV/0!"},1]
[4047,"ALVORADA DE MINAS",4047,"MG","Alvorada De Minas",3102407,3546,1450,947,68.400000000000006,68.400000000000006,1,3]
[566,"ANGELANDIA",566,"MG","Angelandia",3102852,8003,4036,4036,188.43,188.43,1,3]
[568,"ARICANDUVA",568,"MG","Aricanduva",3104452,4770,1695,1695,81.760000000000005,81.760000000000005,1,3]
[4245,"CAPELINHA",4245,"MG","Capelinha",3112307,34803,24753,24753,941.68,941.68,1,3]
[4269,"CARBONITA",4269,"MG","Carbonita",3113503,9148,6738,6738,203.83,203.83,1,3]
[4321,"CHAPADA DO NORTE",4321,"MG","Chapada Do Norte",3116100,15189,5694,3176,12.32,12.32,1,3]
[4349,"CONCEICAO DO MATO DENTRO",4349,"MG","Conceicao Do Mato Dentro",3117504,17908,12269,10172,472.13,472.13,1,3]
[4361,"CONGONHAS DO NORTE",4361,"MG","Congonhas Do Norte",{"$error":"#N/A"},{"$error":"#N/A"},{"$error":"#N/A"},{"$error":"#N/A"},{"$error":"#N/A"},{"$error":"#N/A"},{"$error":"#N/A"},1]
[4401,"COUTO DE MAGALHAES DE MINAS",4401,"MG","Couto De Magalhaes De Minas",3120102,4204,3835,3835,159.88999999999999,159.88999999999999,1,3]
[4419,"DATAS",4419,"MG","Datas",3121001,5211,3088,3088,98,98,1,3]
[4431,"DIAMANTINA",4431,"MG","Diamantina",3121605,45880,40064,32891,1254.4100000000001,1254.4100000000001,1,3]
[4507,"FELICIO DOS SANTOS",4507,"MG","Felicio Dos Santos",{"$error":"#N/A"},{"$error":"#N/A"},{"$error":"#N/A"},{"$error":"#N/A"},{"$error":"#N/A"},{"$error":"#N/A"},{"$error":"#N/A"},1]
[4551,"GOUVEIA",4551,"MG",{"$f":"PROPER(B835)","v":"Gouveia"},3127602,11681,8229,8229,860,860,1,3]
[4649,"ITAMARANDIBA",4649,"MG","Itamarandiba",3132503,32175,21988,19872,620.58000000000004,620.58000000000004,1,3]
[642,"LEME DO PRADO",642,"MG","Leme Do Prado",3138351,4804,1761,1177,72.209999999999994,72.209999999999994,1,3]
[4835,"MINAS NOVAS",4835,"MG","Minas Novas",3141801,30794,12584,9547,212.26,212.26,1,3]
[5065,"PRESIDENTE KUBITSCHEK",5065,"MG","Presidente Kubitschek",3153301,2959,2017,2017,208,208,1,3]
[5203,"SANTO ANTONIO DO ITAMBE",5203,"MG","Santo Antonio Do Itambe",3160207,4135,1230,1230,0,0,{"$error":"#DIV/0!"},1]
[4509,"SAO GONCALO DO RIO PRETO",4509,"MG","Sao Goncalo Do Rio Preto",3125507,3056,1954,1954,52.75,52.75,1,3]
[5317,"SENADOR MODESTINO GONCALVES",5317,"MG","Senador Modestino Goncalves",3165909,4574,1803,1803,64,64,1,3]
[5329,"SERRA AZUL DE MINAS",5329,"MG","Serra Azul De Minas",3166501,4220,1710,1710,41.96,41.96,1,3]
[5341,"SERRO",5341,"MG","Serro",3167103,20835,12895,10496,346.48,346.48,1,3]
[5393,"TURMALINA",5393,"MG","Turmalina",3169703,18055,12926,12169,380.51,380.51,1,3]
[754,"VEREDINHA",754,"MG","Veredinha",3171071,5549,3769,2500,123.65,123.65,1,3]
[4595,"IBIRITE",4595,"MG","Ibirite",3129806,158954,158590,84017,4336.62,4336.62,1,3]
[648,"MARIO CAMPOS",648,"MG","Mario Campos",3140159,13192,12458,12458,0,0,{"$error":"#DIV/0!"},1]
[730,"SARZEDO",730,"MG","Sarzedo",3165537,25814,25532,25532,1208,1208,1,3]
[4063,"ARACAI",4063,"MG","Aracai",3103207,2243,1783,1783,0,0,{"$error":"#DIV/0!"},1]
[4099,"BALDIM",4099,"MG","Baldim",3105004,7913,5067,2920,221,221,1,3]
[4191,"CACHOEIRA DA PRATA",4191,"MG","Cachoeira Da Prata",3109600,3654,3528,3528,180.92,180.92,1,3]
[4197,"CAETANOPOLIS",4197,"MG","Caetanopolis",3109907,10218,8389,8160,100,100,1,3]
[4377,"CORDISBURGO",4377,"MG","Cordisburgo",3118908,8667,5961,5148,125.63,125.63,1,3]
[4527,"FORTUNA DE MINAS",4527,"MG","Fortuna De Minas",{"$error":"#N/A"},{"$error":"#N/A"},{"$error":"#N/A"},{"$error":"#N/A"},{"$error":"#N/A"},{"$error":"#N/A"},{"$error":"#N/A"},1]
[4543,"FUNILANDIA",4543,"MG","Funilandia",3127206,3855,2029,2029,64.959999999999994,64.959999999999994,1,3]
[4619,"INHAUMA",4619,"MG","Inhauma",3131000,5760,4206,4206,87.34,87.34,1,3]
[4713,"JEQUITIBA",4713,"MG","Jequitiba",3135704,5156,1963,1709,244.08,244.08,1,3]
[4947,"PARAOPEBA",4947,"MG","Paraopeba",3147402,22563,19663,19663,621.41,621.41,1,3]
[5071,"PRUDENTE DE MORAIS",5071,"MG","Prudente De Morais",3153608,9573,9199,9199,279.37,279.37,1,3]
[5169,"SANTANA DE PIRAPAMA",5169,"MG","Santana De Pirapama",3158508,8009,3331,3261,300,300,1,3]
[5343,"SETE LAGOAS",5343,"MG","Sete Lagoas",3167202,214152,208956,205256,11403.18,11403.18,1,3]
[" ","CARTEIRA LEASING",null,"MG","Carteira Leasing",{"$error":"#N/A"},{"$error":"#N/A"},{"$error":"#N/A"},{"$error":"#N/A"},{"$error":"#N/A"},{"$error":"#N/A"},{"$error":"#N/A"},1]

{"sheet":"Equip. medicao","index":8,"n_rows":5,"n_cols":1,"rows_kept":5,"cut":false,"hidden":true,"merged":[]}
["Calha Parshall"]
["Hidrômetro"]
["Não instalada"]
["Não tem medidor"]
["Outro"]

{"sheet":"modo uso","index":9,"n_rows":8,"n_cols":4,"rows_kept":8,"cut":false,"hidden":true,"merged":[]}
["Captação em curso de água ou barramento","Superficial",null,"Superficial"]
["Captação em poço tubular, poço manual /cisterna","Subterraneo",null,"Subterrâneo"]
["Captação em nascente","Subterraneo",null,"Subterrâneo"]
["Rebaixamento para Mineração ","Subterraneo",10,"Subterrâneo"]
["Rebaixamento outras finalidades","Subterraneo",null,"Subterrâneo"]
["Captação de Água Subterrânea para Fins de Pesquisa Hidrogeológica","Subterraneo",23,"Subterrâneo"]
["Dragagem em cava aluvionar (exceto SF2; PS1 e PS2)","Subterraneo",null,"Subterrâneo"]
["Dragagem em curso d'água (exceto SF2; PS1 e PS2)","Superficial",null,"Superficial"]

{"sheet":"Valor Lançamento","index":10,"n_rows":35,"n_cols":20,"rows_kept":35,"cut":false,"hidden":false,"merged":[[30,18,30,19],[31,1,32,14],[31,18,31,19],[32,18,32,19],[33,1,34,14],[33,18,33,19],[34,18,34,19],[27,1,27,2],[27,4,27,5],[27,7,27,8],[27,10,27,11],[27,18,27,19],[26,1,26,2],[26,4,26,5],[26,7,26,8],[26,10,26,11],[25,1,25,2],[25,4,25,5],[25,7,25,8],[25,10,25,11],[29,18,29,19],[29,16,29,17],[29,12,29,13],[29,1,29,2],[29,4,29,5],[29,7,29,8],[29,10,29,11],[28,1,28,2],[28,4,28,5],[28,7,28,8],[28,10,28,11],[28,12,28,13],[28,16,28,17],[28,18,28,19],[27,12,27,13],[27,16,27,17],[24,1,24,2],[24,4,24,5],[24,7,24,8],[24,10,24,11],[23,1,23,2],[23,4,23,5],[23,7,23,8],[23,10,23,11],[22,1,22,2],[22,4,22,5],[22,7,22,8],[22,10,22,11],[20,7,20,8],[20,10,20,11],[8,5,8,6],[21,1,21,2],[21,4,21,5],[21,12,21,13],[21,16,21,17],[21,18,21,19],[19,1,19,19],[15,1,15,3],[16,1,16,3],[15,4,15,8],[16,4,16,8],[15,9,15,12],[16,9,16,12],[20,12,20,13],[21,7,21,8],[21,10,21,11],[20,18,20,19],[20,16,20,17],[13,13,13,14],[20,1,20,2],[20,4,20,5],[26,12,26,13],[26,16,26,17],[26,18,26,19],[25,12,25,13],[25,16,25,17],[25,18,25,19],[24,12,24,13],[24,16,24,17],[24,18,24,19],[23,12,23,13],[23,16,23,17],[23,18,23,19],[22,12,22,13],[22,16,22,17],[22,18,22,19],[5,18,5,19],[7,7,7,8],[7,9,7,12],[7,13,7,14],[8,7,8,8],[8,9,8,12],[8,13,8,14],[11,16,11,19],[12,16,12,19],[12,13,12,14],[11,1,11,14],[7,5,7,6],[7,1,7,4],[8,1,8,4],[5,2,5,3],[5,9,5,10],[5,11,5,15],[5,16,5,17],[4,2,4,3],[4,4,4,5],[4,6,4,7],[4,9,4,10],[4,11,4,15],[4,16,4,17],[4,18,4,19],[2,18,2,19],[1,1,1,15]]}
[]
[null,"SIMULADOR COBRANÇA PELO USO DE RECURSOS HÍDRICOS - CRH MG ",null,null,null,null,null,null,null,null,null,null,null,null,null,null,null,null,{"$f":"'Valor Captação'!S3","v":" Versão 1.0.0.12 - 20/01/2025"}]
[null,"Para simular os valores, preencha os campos obrigatórios",null,null,null,null,null,null,null,null,null,null,null,null,null,null,null,"Data da simulação:",{"$f":"TODAY()","v":"2025-01-20"}]
[]
[null,"Ano*","N. Portaria",null,null,null,null,null,null,"CPF/CNPJ",null,"Nome/Razão social",null,null,null,null,"inicio do cálculo ",null,"fim do cálculo "]
[null,2023,null,null,null,null,null,null,null,null,null,null,null,null,null,null,{"$f":"DATE(B6,1,1)","v":"2023-01-01"},null,{"$f":"DATE(B6,12,31)","v":"2023-12-31"}]
[]
[null,"Onde é feito o lançamento?*",null,null,null,"Área de conflito?*",null,"Enquadramento*",null,"Bacia hidrográfica*",null,null,null,"Município*",null,"Pop. Urb. Sede","Tipo","Zona","Bacia","CH"]
[null,null,null,null,null,null,null,null,null,null,null,null,null,null,null,{"$f":"IFERROR(VLOOKUP(N9,Municípios!E:I,5,FALSE),\"\")","v":""},{"$f":"IF(B9=\"curso d'água\",\"Superficial\",\"\")","v":""},{"$f":"IFERROR(IF(AND(T9=\"GD1\",OR(I10=0,I10=1)),\"A\",IF(AND(T9=\"GD1\",OR(G10=25,I10=9)),\"B\",IF(T9=\"GD1\",\"C\",(IF(AND(T9=\"GD3\",G10=25),\"A\",IF(AND(T9=\"GD3\",OR(I10=9,I10=0,I10=1)),\"B\",IF(T9=\"GD3\",\"C\",IF(I10=9,\"C\",IF(AND(OR(I10=0,I10=1),G10<>25),\"C\",IF(AND(OR(I10=0,I10=1),G10=25),\"A\",IF(AND(OR(I10=2,I10=3,I10=4),G10=25),\"B\",\"D\"))))))))))),\"\")","v":"D"},{"$f":"IF(J9=\"CERH: Conselho Estadual de Recursos Hídricos\",\"não se aplica\",LEFT(T9,2))","v":""},{"$f":"IFERROR(VLOOKUP(J9,CH!E:H,4,FALSE),\"\")","v":""}]
[null,null,null,null,null,null,{"$f":"IF(G9=\"não\",0,25)","v":25},null,{"$f":"IF(Q9=\"subterrâneo\",9,IF(H9=\"especial\",0,IF(ISBLANK(H9),\"\",H9)))","v":""},null,null,null,"% esgoto tratado no município",{"$f":"IFERROR(VLOOKUP(N9,Municípios!E:L,8,FALSE),0)","v":0},{"$f":"IF(T9<>\"PN3\",0,IFERROR(VLOOKUP(N9,Municípios!E:N,9,FALSE),0))","v":0}]
[]
[null,"Volume mensal lançado em m³/mês*",null,null,null,null,null,null,null,null,null,null,null,null,null,null,"Finalidades*"]
[null,"Jan","Fev","Mar","Abr","Mai","Jun","Jul","Ago","Set","Out","Nov","Dez","Total (m³/ano)",null,null,"Informe pelo menos uma finalidade"]
[null,null,null,null,null,null,null,null,null,null,null,null,null,{"$f":"SUM(B14:M14)","v":0},null,null,"Irrigação",0,"Outro uso rural"]
[null,null,null,null,null,null,null,null,null,null,null,null,null,null,null,null,"Mineração",null,"Rebaixamento",0]
[null,"Dbo bruto em mg/l - média anual*",null,null,"Tipo de tratamento*",null,null,null,null,"Dbo pós tratamento em mg/l - média anual",null,null,null,null,null,null,"Indústria",null,"Saneamento"]
[null,null,null,null,null,null,null,null,null,null,null,null,null,null,null,null,"Cons.humano",null,"Outra finalidade"]
[null,null,null,null,null,null,null,null,null,"Caso não tenha tratamento, deixar em branco",null,null,null,null,null,null,null,{"$f":"IF(R14=\"x\",1,0)","v":0},null,{"$f":"COUNTIFS(R14:T17,\"x\")","v":0}]
[]
[null,"Valores calculados por finalidade para o lançamento e ano base"]
[null,"Finalidades",null,"%","Vol. Lanç (m3/ano)",null,"Dbo (mg/l)","Carga (kg/ano)",null,"PPU (R$/kg)","Valor (R$/ano)",null,null,null,null,null,null,null,"Valor total (R$/ano)"]
[null,"Irrigação",null,{"$f":"IF(OR($T$15=\"x\",$R$14=0),0,IF(AND($R$14=\"x\",$T$18=1),1,IF(AND($R$14=\"x\",$T$18>1),0.9)))","v":0},{"$f":"$N$14*D22","v":0},null,{"$f":"IF(E22=0,0,IF(OR($E$17=\"sem tratamento\",ISBLANK($E$17)),$B$17,$J$17))","v":0},{"$f":"G22/1000*E22","v":0},null,{"$f":"IF(H22=0,0,SUMIFS(ppu!S:S,ppu!A:A,$B$6,ppu!C:C,$R$9,ppu!B:B,$T$9)+SUMIFS(ppu!G:G,ppu!A:A,$B$6,ppu!B:B,$T$9,ppu!C:C,$Q$9))","v":0}]
[null,"Outros usos rurais",null,{"$f":"IF(OR($T$15=\"x\",$T$14=0),0,IF(AND($T$14=\"x\",$T$18=1),1,IF(AND($T$14=\"x\",$T$18>1),(1-$D$22)/($T$18-$R$18))))","v":0},0,null,0,{"$f":"G23/1000*E23","v":0},null,{"$f":"IF(H23=0,0,SUMIFS(ppu!S:S,ppu!A:A,$B$6,ppu!C:C,$R$9,ppu!B:B,$T$9)+SUMIFS(ppu!G:G,ppu!A:A,$B$6,ppu!B:B,$T$9,ppu!C:C,$Q$9))","v":0},{"$f":"H23*J23","v":0},null,null,null,null,null,null,null,{"$f":"K23","v":0}]
[null,"Rebaixamento",null,{"$f":"IF($T$15=0,0,IF($T$15=\"x\",1,0))","v":0},0,null,0,0,null,{"$f":"IF(H24=0,0,SUMIFS(ppu!U:U,ppu!A:A,$B$6,ppu!C:C,$R$9,ppu!B:B,$T$9)+SUMIFS(ppu!G:G,ppu!A:A,$B$6,ppu!B:B,$T$9,ppu!C:C,$Q$9))","v":0},{"$f":"H24*J24","v":0},null,null,null,null,null,null,null,0]
[null,"Mineração",null,{"$f":"IF(OR($T$15=\"x\",$R$15=0),0,IF(AND($R$15=\"x\",$T$18=1),1,IF(AND($R$15=\"x\",$T$18>1),(1-$D$22)/($T$18-$R$18))))","v":0},0,null,0,0,null,{"$f":"IF(H25=0,0,SUMIFS(ppu!U:U,ppu!A:A,$B$6,ppu!C:C,$R$9,ppu!B:B,$T$9)+SUMIFS(ppu!G:G,ppu!A:A,$B$6,ppu!B:B,$T$9,ppu!C:C,$Q$9))","v":0},0,null,null,null,null,null,null,null,0]
[null,"Indústria",null,{"$f":"IF(OR($T$15=\"x\",$R$16=0),0,IF(AND($R$16=\"x\",$T$18=1),1,IF(AND($R$16=\"x\",$T$18>1),(1-$D$22)/($T$18-$R$18))))","v":0},0,null,0,0,null,{"$f":"IF(H26=0,0,SUMIFS(ppu!T:T,ppu!A:A,$B$6,ppu!C:C,$R$9,ppu!B:B,$T$9)+SUMIFS(ppu!G:G,ppu!A:A,$B$6,ppu!B:B,$T$9,ppu!C:C,$Q$9))","v":0},0,null,null,null,null,null,null,null,0]
[null,"Saneamento",null,{"$f":"IF(OR($T$15=\"x\",$T$16=0),0,IF(AND($T$16=\"x\",$T$18=1),1,IF(AND($T$16=\"x\",$T$18>1),(1-$D$22)/($T$18-$R$18))))","v":0},0,null,0,0,null,{"$f":"IF(H27=0,0,IF(P9>=100000,SUMIFS(ppu!R:R,ppu!A:A,$B$6,ppu!B:B,$T$9,ppu!C:C,$R$9,ppu!P:P,O10),IF(P9<100000,SUMIFS(ppu!Q:Q,ppu!A:A,$B$6,ppu!B:B,$T$9,ppu!C:C,$R$9,ppu!P:P,O10)+SUMIFS(ppu!G:G,ppu!A:A,$B$6,ppu!B:B,$T$9,ppu!C:C,$Q$9))))","v":0},0,null,null,null,null,null,null,null,0]
[null,"Consumo humano",null,{"$f":"IF(OR($T$15=\"x\",$R$17=0),0,IF(AND($R$17=\"x\",$T$18=1),1,IF(AND($R$17=\"x\",$T$18>1),(1-$D$22)/($T$18-$R$18))))","v":0},0,null,0,0,null,{"$f":"IF(H28=0,0,SUMIFS(ppu!U:U,ppu!A:A,$B$6,ppu!C:C,$R$9,ppu!B:B,$T$9)+SUMIFS(ppu!G:G,ppu!A:A,$B$6,ppu!B:B,$T$9,ppu!C:C,$Q$9))","v":0},0,null,null,null,null,null,null,null,0]
[null,"Outras finalidades",null,{"$f":"IF(OR($T$15=\"x\",$T$17=0),0,IF(AND($T$17=\"x\",$T$18=1),1,IF(AND($T$17=\"x\",$T$18>1),(1-$D$22)/($T$18-$R$18))))","v":0},0,null,0,0,null,{"$f":"IF(H29=0,0,SUMIFS(ppu!U:U,ppu!A:A,$B$6,ppu!C:C,$R$9,ppu!B:B,$T$9)+SUMIFS(ppu!G:G,ppu!A:A,$B$6,ppu!B:B,$T$9,ppu!C:C,$Q$9))","v":0},0,null,null,null,null,null,null,null,0]
[null,"Total",null,null,{"$f":"ROUND(SUM(E22:F29),2)","v":0},null,0,{"$f":"ROUND(SUM(H22:I29),2)","v":0},null,null,{"$f":"ROUND(SUM(K23:L29),2)","v":0},null,null,null,null,null,{"$f":"SUM(Q22:R29)","v":0},null,{"$f":"SUM(S22:T29)","v":0}]
[null,"Observações:",null,null,null,null,null,null,null,null,null,null,null,null,null,null,null,"Acerto ou Valor acumulado: ",0]
[null,{"$f":"IF(AND(S32>0,S32<200),\"Valores abaixo de R$ 200,00 são acumulados até atingir esse montante para emissão de boletos, conforme Decreto 48.160/2021.\",\"\")","v":""},null,null,null,null,null,null,null,null,null,null,null,null,null,null,null,"Total: ",{"$f":"ROUND(S30-S31,2)","v":0}]
[null,null,null,null,null,null,null,null,null,null,null,null,null,null,null,null,null,"Valor pago:",0]
[null,{"$f":"IF(S31<>0,CONCATENATE(\"DET. DEBITO: Carga. (\",H30,\"kg) [Vlanc = R$\",K30,\"] [Acerto = R$\",S31,\"]  [Total = R$\",S32,\"] [\",V31,\"]\"),CONCATENATE(\"DET. DEBITO: Vol. Out. (\",H30,\"kg) [Vcap = R$\",K30,\"]  [Total = R$\",S32,\"]\",\"\"))","v":"DET. DEBITO: Vol. Out. (0kg) [Vcap = R$0]  [Total = R$0]"},null,null,null,null,null,null,null,null,null,null,null,null,null,null,null,"n. Parcelas a ajustar: ",0]
[null,null,null,null,null,null,null,null,null,null,null,null,null,null,null,null,null,"Valor próximas parcelas: ",{"$f":"IF(S33>0,(S32-S33)/S34,IF(S32<1000,S32,S32/4))","v":0},{"$f":"(S32-S33)/S34","v":{"$error":"#DIV/0!"}}]