{"text_format":"1","workbook":"xlsx","n_sheets":11,"sheets":["Valor Captação","CH","hora","kirrig","kfin","kclasse","ppu","Municípios","Equip. medicao","modo uso","Valor Lançamento"],"not_rendered":{"charts":0,"images":1,"macros":1,"external_links":0,"defined_names":13,"comments":0,"pivot_tables":0},"unopened":[],"bounds":{"document_bytes":16777216,"sheet_cells":100000,"rows_first":2000,"rows_last":500,"rows_between":2000,"halvings":0,"cell_chars":16384,"cell_head_chars":4096},"cells_cut":0,"cells_raw":0,"read":"whole","date_system":"1900"}

{"sheet":"Valor Captação","index":0,"n_rows":52,"n_cols":20,"rows_kept":52,"cut":false,"hidden":false,"merged":[[41,1,42,14],[43,1,44,14],[40,18,40,19],[41,18,41,19],[42,18,42,19],[43,18,43,19],[44,18,44,19],[9,1,9,5],[8,1,8,5],[36,18,36,19],[35,1,35,2],[35,4,35,5],[35,9,35,10],[35,12,35,13],[35,16,35,17],[35,18,35,19],[34,1,34,2],[34,4,34,5],[34,9,34,10],[34,12,34,13],[34,16,34,17],[34,18,34,19],[36,1,36,2],[36,4,36,5],[46,1,46,19],[49,1,49,19],[50,1,50,19],[45,1,45,19],[48,1,48,19],[37,1,37,2],[37,4,37,5],[37,9,37,10],[37,12,37,13],[37,16,37,17],[37,18,37,19],[39,18,39,19],[38,18,38,19],[47,1,47,19],[39,1,39,2],[39,4,39,5],[39,9,39,10],[39,12,39,13],[39,16,39,17],[38,1,38,2],[38,4,38,5],[38,9,38,10],[38,12,38,13],[38,16,38,17],[31,18,31,19],[36,9,36,10],[36,12,36,13],[36,16,36,17],[33,1,33,2],[33,4,33,5],[33,9,33,10],[33,12,33,13],[33,16,33,17],[33,18,33,19],[8,7,8,8],[9,7,9,8],[8,9,8,12],[8,13,8,14],[9,13,9,14],[27,8,27,12],[27,16,27,17],[19,1,19,2],[29,1,29,19],[20,2,20,10],[20,13,20,14],[20,16,20,17],[20,18,20,19],[23,17,23,19],[24,17,24,19],[27,5,27,6],[22,1,22,19],[25,17,25,19],[25,2,25,3],[27,3,27,4],[9,9,9,12],[24,2,24,3],[51,1,51,19],[11,1,11,14],[11,16,11,19],[12,16,12,19],[16,1,16,2],[17,1,17,2],[18,1,18,2],[30,1,30,2],[30,4,30,5],[30,9,30,10],[30,12,30,13],[30,16,30,17],[30,18,30,19],[32,1,32,2],[32,4,32,5],[32,9,32,10],[32,12,32,13],[32,16,32,17],[32,18,32,19],[31,1,31,2],[31,4,31,5],[31,9,31,10],[31,12,31,13],[31,16,31,17],[5,4,5,5],[5,6,5,7],[5,9,5,10],[5,11,5,15],[5,16,5,17],[5,18,5,19],[3,18,3,19],[6,4,6,5],[6,6,6,7],[6,9,6,10],[6,11,6,15],[6,16,6,17],[6,18,6,19],[2,1,2,13]]}
[null,null,null,null,null,null,null,null,null,null,null,null,null,null,null,"Data de atualização:","2023-04-03",null,null,"Versão 1.0.0.5"]
[]
[null,"SIMULADOR COBRANÇA PELO USO DE RECURSOS HÍDRICOS - CRH MG",null,null,null,null,null,null,null,null,null,null,null,null,null,null,null,null," Versão 1.0.0.12 - 20/01/2025"]
[null,"Para simular os valores, preencha os campos obrigatórios",null,null,null,null,null,null,null,null,null,null,null,null,"Versão 1.0.0.5",null,null,"Data da simulação:",{"$f":"TODAY()","v":"2025-01-20"}]
[]
[null,"Ano*","N. Portaria","n. Ponto","Data de Publicação*",null,"Data de Vencimento*",null,"Renov. Em analise?*","CPF/CNPJ",null,"Nome/Razão social",null,null,null,null,"inicio do cálculo ",null,"fim do cálculo "]
[null,2023,null,null,null,null,null,null,null,null,null,null,null,null,null,null,{"$f":"IF(ISBLANK(E7),DATE(B7,1,1),IF(YEAR(E7)=B7,E7,IF(I7=\"sim\",DATE(B7,1,1),IFERROR(IF(YEAR(G7)<B7,0,IF(YEAR(E7)>B7,0,DATE(B7,1,1))),0))))","v":"2023-01-01"},null,{"$f":"IF(YEAR(E7)>B7,0,IF(I7=\"SIM\",DATE(B7,12,31),IF(ISBLANK(G7),DATE(B7,12,31),IF(YEAR(G7)>B7,DATE(B7,12,31),IF(YEAR(G7)<B7,0,G7)))))","v":"2023-12-31"}]
[]
[null,"Selecione um Modo de uso*",null,null,null,null,"Área de conflito?","Enquadramento*",null,"Selecione a Bacia hidrográfica*",null,null,null,"Município*",null,"Pop. Urb. Sede","Tipo","Zona","Bacia","CH"]
[null,null,null,null,null,null,null,null,null,null,null,null,null,null,null,{"$f":"IFERROR(VLOOKUP(N10,Municípios!E:I,5,FALSE),\"\")","v":""},{"$f":"IFERROR(VLOOKUP(B10,'modo uso'!A:D,4,FALSE),\"\")","v":""},{"$f":"IFERROR(IF(AND(T10=\"GD1\",OR(I11=0,I11=1)),\"A\",IF(AND(T10=\"GD1\",OR(G11=25,I11=9)),\"B\",IF(T10=\"GD1\",\"C\",(IF(AND(T10=\"GD3\",G11=25),\"A\",IF(AND(T10=\"GD3\",OR(I11=9,I11=0,I11=1)),\"B\",IF(T10=\"GD3\",\"C\",IF(I11=9,\"C\",IF(AND(OR(I11=0,I11=1),G11<>25),\"C\",IF(AND(OR(I11=0,I11=1),G11=25),\"A\",IF(AND(OR(I11=2,I11=3,I11=4),G11=25),\"B\",\"D\"))))))))))),\"\")","v":"B"},{"$f":"IF(J10=\"CERH: Conselho Estadual de Recursos Hídricos\",\"não se aplica\",LEFT(T10,2))","v":""},{"$f":"IFERROR(VLOOKUP(J10,CH!E:H,4,FALSE),\"\")","v":""}]
[null,null,null,null,null,null,{"$f":"IF(G10=\"não\",0,25)","v":25},null,{"$f":"IF(Q11=\"subterraneo\",9,IF(H10=\"especial\",0,IF(ISBLANK(H10),2,H10)))","v":2},null,null,null,null,null,null,null,{"$f":"IFERROR(VLOOKUP(B10,'modo uso'!A:B,2,FALSE),\"\")","v":""}]
[null,"Quadro de vazão outorgada*",null,null,null,null,null,null,null,null,null,null,null,null,null,null,"Finalidades outorgadas*"]
[null,"Outorga","Unidade*","Jan","Fev","Mar","Abr","Mai","Jun","Jul","Ago","Set","Out","Nov","Dez",null,"Informe pelo menos uma finalidade"]
[null,null,null,31,{"$f":"IF(OR(B7=2016,B7=2020,B7=2024),29,28)","v":28},31,30,31,30,31,31,30,31,30,31]
[null,null,null,1,2,3,4,5,6,7,8,9,10,11,12]
{"$rows_left_out":38}
{"sheet":"CH","index":1,"n_rows":40,"n_cols":8,"rows_kept":40,"cut":false,"hidden":true,"merged":[]}
["SelcioneumaCH","codigo","Bacia cobrada nesse arquivo? 1 = sim e 0 = não","Nome da Bacia","Selecione uma circunscrição hidrográfica","ano inicio da cobrança","ano base inicio do modelo","SelcioneumaCH"]
["CERH",0,{"$f":"IF(F2=0,0,IF(G2<='Valor Captação'!$B$7,1,0))","v":1},"Conselho Estadual de Recursos Hídricos",{"$f":"CONCATENATE(A2,\" - \",D2)","v":"CERH - Conselho Estadual de Recursos Hídricos"},2023,2022,"CERH"]
["DO1",11,{"$f":"IF(F3=0,0,IF(G3<='Valor Captação'!$B$7,1,0))","v":0},"Bacia do Rio Piranga","DO1 - Bacia do Rio Piranga",2012,2024,"DO1"]
["DO2",12,{"$f":"IF(F4=0,0,IF(G4<='Valor Captação'!$B$7,1,0))","v":0},"Bacia do Rio Piracicaba","DO2 - Bacia do Rio Piracicaba",2012,2024,"DO2"]
["DO3",13,{"$f":"IF(F5=0,0,IF(G5<='Valor Captação'!$B$7,1,0))","v":0},"Bacia do Rio Santo Antônio","DO3 - Bacia do Rio Santo Antônio",2012,2024,"DO3"]
["DO4",14,{"$f":"IF(F6=0,0,IF(G6<='Valor Captação'!$B$7,1,0))","v":0},"Bacia do Rio Suaçui Grande","DO4 - Bacia do Rio Suaçui Grande",2012,2024,"DO4"]
["DO5",15,{"$f":"IF(F7=0,0,IF(G7<='Valor Captação'!$B$7,1,0))","v":0},"Bacia do Rio Caratinga","DO5 - Bacia do Rio Caratinga",2012,2024,"DO5"]
["DO6",16,{"$f":"IF(F8=0,0,IF(G8<='Valor Captação'!$B$7,1,0))","v":0},"Bacia do Rio Manhuaçu","DO6 - Bacia do Rio Manhuaçu",2012,2024,"DO6"]
["GD1","01",{"$f":"IF(F9=0,0,IF(G9<='Valor Captação'!$B$7,1,0))","v":1},"Bacia do Alto Rio Grande","GD1 - Bacia do Alto Rio Grande",2023,2023,"GD1"]
["GD2","02",{"$f":"IF(F10=0,0,IF(G10<='Valor Captação'!$B$7,1,0))","v":1},"Bacia Vertentes do Rio Grande","GD2 - Bacia Vertentes do Rio Grande",2022,2022,"GD2"]
["GD3","03",{"$f":"IF(F11=0,0,IF(G11<='Valor Captação'!$B$7,1,0))","v":1},"Bacia do Entorno do Reservatório de Furnas","GD3 - Bacia do Entorno do Reservatório de Furnas",2022,2022,"GD3"]
["GD4","04",{"$f":"IF(F12=0,0,IF(G12<='Valor Captação'!$B$7,1,0))","v":1},"Bacia do Rio Verde","GD4 - Bacia do Rio Verde",2023,2023,"GD4"]
["GD5","05",{"$f":"IF(F13=0,0,IF(G13<='Valor Captação'!$B$7,1,0))","v":1},"Bacia do Rio Sapucaí","GD5 - Bacia do Rio Sapucaí",2023,2023,"GD5"]
["GD6","06",{"$f":"IF(F14=0,0,IF(G14<='Valor Captação'!$B$7,1,0))","v":1},"Bacia dos Afluentes Mineiros dos Rios Mogi-Guaçu / Pardo","GD6 - Bacia dos Afluentes Mineiros dos Rios Mogi-Guaçu / Pardo",2023,2023,"GD6"]
["GD7","07",{"$f":"IF(F15=0,0,IF(G15<='Valor Captação'!$B$7,1,0))","v":1},"Bacia dos Afluentes Mineiros do Médio Grande","GD7 - Bacia dos Afluentes Mineiros do Médio Grande",2023,2023,"GD7"]
{"$rows_left_out":26}
{"sheet":"hora","index":2,"n_rows":12,"n_cols":26,"rows_kept":12,"cut":false,"hidden":true,"merged":[]}
["Rebaixamento","Irrigação"," \nDessedentação","\n(Aquicultura)","Mineração","Industria","Saneamento","Outra Consumo humano","Outra \n(lavagem veículos)","Outra\n(Recirculação)","Outra \n(total)",null,null,"MESES\n(NÃO APAGAR)",1,2,3,4,5,6,7,8,9,10,11,12]
[24,20,20,24,8,20,16,20,2,24,24]
[]
[]
[]
[]
[null,"Rebaixamento","Irrigação","animais","Aqüicultura","extração","Industria","abastecimento","humano","lavagem","recirculação","outra"]
["n. vezes",75,1111,141,56,484,435,225,513,109,17,5213]
["h/dia",24,20,20,24,0,20,16,20,2,0,0]
[]
["n. vezes",10,931,138,20,468,375,128,482,97,12,181]
["h/dia",0,21,2,0,8,24,20,2,8,24,24]

{"sheet":"kirrig","index":3,"n_rows":305,"n_cols":7,"rows_kept":305,"cut":false,"hidden":true,"merged":[]}
[null,"UPGRH","Sistema de irrigação","cap","cons",null,"Gotejamento"]
[null,"DO1","gotejamento",2.5000000000000001E-2,0,null,"Micro aspersão"]
[null,"DO1","micro aspersão",2.5000000000000001E-2,0,null,"Pivô central"]
[null,"DO1","pivô central",2.5000000000000001E-2,0,null,"Tubos perfurados"]
[null,"DO1","tubos perfurados",2.5000000000000001E-2,0,null,"Aspersão convencional"]
[null,"DO1","aspersão convencional",2.5000000000000001E-2,0,null,"Sulcos"]
[null,"DO1","sulcos",2.5000000000000001E-2,0,null,"Inundação"]
[null,"DO1","inundação",2.5000000000000001E-2,0,null,"Outro"]
[null,"DO1","Outro",2.5000000000000001E-2,0]
[null,"DO2","gotejamento",0.05,0]
[null,"DO2","micro aspersão",0.05,0]
[null,"DO2","pivô central",0.05,0]
[null,"DO2","tubos perfurados",0.05,0]
[null,"DO2","aspersão convencional",0.05,0]
[null,"DO2","sulcos",0.05,0]
{"$rows_left_out":291}
{"sheet":"kfin","index":4,"n_rows":38,"n_cols":5,"rows_kept":38,"cut":false,"hidden":true,"merged":[]}
[null,"UPGRH","krural","mineração","rebaixamento"]
[null,"DO1",2.5000000000000001E-2,1,1]
[null,"DO2",0.05,1,1]
[null,"DO3",2.5000000000000001E-2,1,1]
[null,"DO4",2.5000000000000001E-2,1,1]
[null,"DO5",2.5000000000000001E-2,1,1]
[null,"DO6",0.05,1,1]
[null,"PJ1",0.1,1,1]
[null,"PN2",0.1,1,1]
[null,"PS1",0.05,1,1]
[null,"PS2",0.05,1,1]
[null,"SF2",0.15,1,1]
[null,"SF5",2.5000000000000001E-2,0.75,0.5]
[null,"GD2",1,1,1]
[null,"GD3",1,1,1]
{"$rows_left_out":24}
{"sheet":"kclasse","index":5,"n_rows":241,"n_cols":4,"rows_kept":241,"cut":false,"hidden":true,"merged":[]}
[null,"UPGRH","Classe","kclasse"]
[null,"DO1",0,1.1499999999999999]
[null,"DO1",1,1.1000000000000001]
[null,"DO1",2,1]
[null,"DO1",3,0.9]
[null,"DO1",4,0.8]
[null,"DO1",9,1]
[null,"DO2",0,1.1499999999999999]
[null,"DO2",1,1.1000000000000001]
[null,"DO2",2,1]
[null,"DO2",3,0.9]
[null,"DO2",4,0.8]
[null,"DO2",9,1]
[null,"DO3",0,1.1499999999999999]
[null,"DO3",1,1.1000000000000001]
{"$rows_left_out":227}
{"sheet":"ppu","index":6,"n_rows":410,"n_cols":21,"rows_kept":410,"cut":false,"hidden":true,"merged":[]}
["ANO","CH","TIPO/ZONA","PPU CAP "," PPU CONS "," PPU TRANSP "," PPU LANC "," PPUcap Saneamento <100.000hab "," ppu cap saneamento >= 100.000 hab "," PPUcap Rural"," PPUcap irrigacao <=250.000m3"," ppu cap irrigacao >250.000m3"," PPU cap rebaixamento p/ mineraCAo "," PPU cap Industria"," PPUcap demais finalidades ","Faixa tratamento esgoto saneamento","  PPUlanc Saneamento (< 100mil hab sede urbana) ","  PPUlanc Saneamento (>=100mil hab sede urbana) ","  PPU lanC AgropecuAria  ","ppu lanç Industria","  PPU lanC demais finalidades  "]
[2010,"PJ1","SUBTERRANEO",1.15E-2,0.02,0,0.1,0,0,0,0,0,0,0,0,0,0,0,0,0,0]
[2010,"PJ1","SUPERFICIAL",0.01,0.02,0,0.1,0,0,0,0,0,0,0,0,0,0,0,0,0,0]
[2010,"PN2","SUBTERRANEO",1.15E-2,0.02,0,0.1,0,0,0,0,0,0,0,0,0,0,0,0,0,0]
[2010,"PN2","SUPERFICIAL",0.01,0.02,0,0.1,0,0,0,0,0,0,0,0,0,0,0,0,0,0]
[2010,"SF5","SUBTERRANEO",0.01,0.02,0,7.0000000000000007E-2,0,0,0,0,0,0,0,0,0,0,0,0,0,0]
[2010,"SF5","SUPERFICIAL",0.01,0.02,0,7.0000000000000007E-2,0,0,0,0,0,0,0,0,0,0,0,0,0,0]
[2011,"PJ1","SUBTERRANEO",1.15E-2,0.02,0,0.1,0,0,0,0,0,0,0,0,0,0,0,0,0,0]
[2011,"PJ1","SUPERFICIAL",0.01,0.02,0,0.1,0,0,0,0,0,0,0,0,0,0,0,0,0,0]
[2011,"PN2","SUBTERRANEO",1.15E-2,0.02,0,0.1,0,0,0,0,0,0,0,0,0,0,0,0,0,0]
[2011,"PN2","SUPERFICIAL",0.01,0.02,0,0.1,0,0,0,0,0,0,0,0,0,0,0,0,0,0]
[2011,"SF5","SUBTERRANEO",0.01,0.02,0,7.0000000000000007E-2,0,0,0,0,0,0,0,0,0,0,0,0,0,0]
[2011,"SF5","SUPERFICIAL",0.01,0.02,0,7.0000000000000007E-2,0,0,0,0,0,0,0,0,0,0,0,0,0,0]
[2012,"DO1","SUBTERRANEO",2.1000000000000001E-2,0,2.1999999999999999E-2,0,0,0,0,0,0,0,0,0,0,0,0,0,0,0]
[2012,"DO1","SUPERFICIAL",1.7999999999999999E-2,0,2.1999999999999999E-2,0.1,0,0,0,0,0,0,0,0,0,0,0,0,0,0]
{"$rows_left_out":396}
{"sheet":"Municípios","index":7,"n_rows":863,"n_cols":13,"rows_kept":863,"cut":false,"hidden":true,"merged":[]}
["TOM_Texto","MUNICIPIO","TOM_Num","UF","Selecione o município","COD IBGE","POP RESIDENTE","POP URBANA","POP NA SEDE","ES005 - Volume de esgotos coletado","ES006 - Volume de esgotos tratado","% ESGOTO TRATADO","FAIXA "]
[4123,"BELO HORIZONTE",4123,"MG",{"$f":"PROPER(B2)","v":"Belo Horizonte"},3106200,2375151,2375151,1433290,106982.96,106982.96,1,3]
[4127,"BELO VALE",4127,"MG",{"$f":"PROPER(B3)","v":"Belo Vale"},3106408,7536,3295,3182,1300,1300,1,3]
[4359,"CONGONHAS",4359,"MG","Congonhas",3118007,48519,47236,39696,1542.29,1542.29,1,3]
[4427,"DESTERRO DE ENTRE RIOS",4427,"MG","Desterro De Entre Rios",3121407,7002,3596,2868,622,622,1,3]
[5241,"SAO GOTARDO",5241,"MG","Sao Gotardo",3162104,31819,30061,26156,1612.85,1612.85,1,3]
[5079,"RAUL SOARES",5079,"MG","Raul Soares",3154002,23818,15484,13070,814.02,814.02,1,3]
[4477,"ENTRE RIOS DE MINAS",4477,"MG","Entre Rios De Minas",3123908,14242,9878,9516,1000,1000,1,3]
[4707,"JECEABA",4707,"MG","Jeceaba",3135407,5395,2988,2594,250.63,250.63,1,3]
[4845,"MOEDA",4845,"MG","Moeda",3142304,4689,1789,1614,0,0,{"$error":"#DIV/0!"},1]
[5065,"PRESIDENTE KUBTSCHEK",5065,"MG","Presidente Kubtschek",3153301,2959,2017,2017,208,208,1,3]
[5441,"VISCONDE DO RIO BRANCO",5441,"MG","Visconde Do Rio Branco",3172004,37942,31380,31380,1204.1400000000001,1204.1400000000001,1,3]
[5097,"RIO CASCA",5097,"MG","Rio Casca",3154903,14201,11334,10871,310.31,310.31,1,3]
[4289,"CARMOPOLIS DE MINAS",4289,"MG","Carmopolis De Minas",3114501,17048,11821,11821,735,735,1,3]
[4917,"OURO BRANCO",4917,"MG","Ouro Branco",3145901,35268,31609,31609,1361.55,1361.55,1,3]
{"$rows_left_out":849}
{"sheet":"Equip. medicao","index":8,"n_rows":5,"n_cols":1,"rows_kept":5,"cut":false,"hidden":true,"merged":[]}
["Calha Parshall"]
["Hidrômetro"]
["Não instalada"]
["Não tem medidor"]
["Outro"]

{"sheet":"modo uso","index":9,"n_rows":8,"n_cols":4,"rows_kept":8,"cut":false,"hidden":true,"merged":[]}
["Captação em curso de água ou barramento","Superficial",null,"Superficial"]
["Captação em poço tubular, poço manual /cisterna","Subterraneo",null,"Subterrâneo"]
["Captação em nascente","Subterraneo",null,"Subterrâneo"]
["Rebaixamento para Mineração ","Subterraneo",10,"Subterrâneo"]
["Rebaixamento outras finalidades","Subterraneo",null,"Subterrâneo"]
["Captação de Água Subterrânea para Fins de Pesquisa Hidrogeológica","Subterraneo",23,"Subterrâneo"]
["Dragagem em cava aluvionar (exceto SF2; PS1 e PS2)","Subterraneo",null,"Subterrâneo"]
["Dragagem em curso d'água (exceto SF2; PS1 e PS2)","Superficial",null,"Superficial"]

{"sheet":"Valor Lançamento","index":10,"n_rows":35,"n_cols":20,"rows_kept":35,"cut":false,"hidden":false,"merged":[[30,18,30,19],[31,1,32,14],[31,18,31,19],[32,18,32,19],[33,1,34,14],[33,18,33,19],[34,18,34,19],[27,1,27,2],[27,4,27,5],[27,7,27,8],[27,10,27,11],[27,18,27,19],[26,1,26,2],[26,4,26,5],[26,7,26,8],[26,10,26,11],[25,1,25,2],[25,4,25,5],[25,7,25,8],[25,10,25,11],[29,18,29,19],[29,16,29,17],[29,12,29,13],[29,1,29,2],[29,4,29,5],[29,7,29,8],[29,10,29,11],[28,1,28,2],[28,4,28,5],[28,7,28,8],[28,10,28,11],[28,12,28,13],[28,16,28,17],[28,18,28,19],[27,12,27,13],[27,16,27,17],[24,1,24,2],[24,4,24,5],[24,7,24,8],[24,10,24,11],[23,1,23,2],[23,4,23,5],[23,7,23,8],[23,10,23,11],[22,1,22,2],[22,4,22,5],[22,7,22,8],[22,10,22,11],[20,7,20,8],[20,10,20,11],[8,5,8,6],[21,1,21,2],[21,4,21,5],[21,12,21,13],[21,16,21,17],[21,18,21,19],[19,1,19,19],[15,1,15,3],[16,1,16,3],[15,4,15,8],[16,4,16,8],[15,9,15,12],[16,9,16,12],[20,12,20,13],[21,7,21,8],[21,10,21,11],[20,18,20,19],[20,16,20,17],[13,13,13,14],[20,1,20,2],[20,4,20,5],[26,12,26,13],[26,16,26,17],[26,18,26,19],[25,12,25,13],[25,16,25,17],[25,18,25,19],[24,12,24,13],[24,16,24,17],[24,18,24,19],[23,12,23,13],[23,16,23,17],[23,18,23,19],[22,12,22,13],[22,16,22,17],[22,18,22,19],[5,18,5,19],[7,7,7,8],[7,9,7,12],[7,13,7,14],[8,7,8,8],[8,9,8,12],[8,13,8,14],[11,16,11,19],[12,16,12,19],[12,13,12,14],[11,1,11,14],[7,5,7,6],[7,1,7,4],[8,1,8,4],[5,2,5,3],[5,9,5,10],[5,11,5,15],[5,16,5,17],[4,2,4,3],[4,4,4,5],[4,6,4,7],[4,9,4,10],[4,11,4,15],[4,16,4,17],[4,18,4,19],[2,18,2,19],[1,1,1,15]]}
[]
[null,"SIMULADOR COBRANÇA PELO USO DE RECURSOS HÍDRICOS - CRH MG ",null,null,null,null,null,null,null,null,null,null,null,null,null,null,null,null,{"$f":"'Valor Captação'!S3","v":" Versão 1.0.0.12 - 20/01/2025"}]
[null,"Para simular os valores, preencha os campos obrigatórios",null,null,null,null,null,null,null,null,null,null,null,null,null,null,null,"Data da simulação:",{"$f":"TODAY()","v":"2025-01-20"}]
[]
[null,"Ano*","N. Portaria",null,null,null,null,null,null,"CPF/CNPJ",null,"Nome/Razão social",null,null,null,null,"inicio do cálculo ",null,"fim do cálculo "]
[null,2023,null,null,null,null,null,null,null,null,null,null,null,null,null,null,{"$f":"DATE(B6,1,1)","v":"2023-01-01"},null,{"$f":"DATE(B6,12,31)","v":"2023-12-31"}]
[]
[null,"Onde é feito o lançamento?*",null,null,null,"Área de conflito?*",null,"Enquadramento*",null,"Bacia hidrográfica*",null,null,null,"Município*",null,"Pop. Urb. Sede","Tipo","Zona","Bacia","CH"]
[null,null,null,null,null,null,null,null,null,null,null,null,null,null,null,{"$f":"IFERROR(VLOOKUP(N9,Municípios!E:I,5,FALSE),\"\")","v":""},{"$f":"IF(B9=\"curso d'água\",\"Superficial\",\"\")","v":""},{"$f":"IFERROR(IF(AND(T9=\"GD1\",OR(I10=0,I10=1)),\"A\",IF(AND(T9=\"GD1\",OR(G10=25,I10=9)),\"B\",IF(T9=\"GD1\",\"C\",(IF(AND(T9=\"GD3\",G10=25),\"A\",IF(AND(T9=\"GD3\",OR(I10=9,I10=0,I10=1)),\"B\",IF(T9=\"GD3\",\"C\",IF(I10=9,\"C\",IF(AND(OR(I10=0,I10=1),G10<>25),\"C\",IF(AND(OR(I10=0,I10=1),G10=25),\"A\",IF(AND(OR(I10=2,I10=3,I10=4),G10=25),\"B\",\"D\"))))))))))),\"\")","v":"D"},{"$f":"IF(J9=\"CERH: Conselho Estadual de Recursos Hídricos\",\"não se aplica\",LEFT(T9,2))","v":""},{"$f":"IFERROR(VLOOKUP(J9,CH!E:H,4,FALSE),\"\")","v":""}]
[null,null,null,null,null,null,{"$f":"IF(G9=\"não\",0,25)","v":25},null,{"$f":"IF(Q9=\"subterrâneo\",9,IF(H9=\"especial\",0,IF(ISBLANK(H9),\"\",H9)))","v":""},null,null,null,"% esgoto tratado no município",{"$f":"IFERROR(VLOOKUP(N9,Municípios!E:L,8,FALSE),0)","v":0},{"$f":"IF(T9<>\"PN3\",0,IFERROR(VLOOKUP(N9,Municípios!E:N,9,FALSE),0))","v":0}]
[]
[null,"Volume mensal lançado em m³/mês*",null,null,null,null,null,null,null,null,null,null,null,null,null,null,"Finalidades*"]
[null,"Jan","Fev","Mar","Abr","Mai","Jun","Jul","Ago","Set","Out","Nov","Dez","Total (m³/ano)",null,null,"Informe pelo menos uma finalidade"]
[null,null,null,null,null,null,null,null,null,null,null,null,null,{"$f":"SUM(B14:M14)","v":0},null,null,"Irrigação",0,"Outro uso rural"]
[null,null,null,null,null,null,null,null,null,null,null,null,null,null,null,null,"Mineração",null,"Rebaixamento",0]
{"$rows_left_out":20}